{"text_format":"1","workbook":"xlsx","n_sheets":12,"sheets":["プレシーズンゲーム","注意事項","①団体情報入力","②選手情報入力","③リレー情報確認","④種目別人数","　　　　　","種目情報","data_kyogisha","data_team","Sheet6","Sheet1"],"not_rendered":{"charts":0,"images":1,"macros":0,"external_links":4,"defined_names":31,"comments":2,"pivot_tables":0},"unopened":[],"bounds":{"document_bytes":16777216,"sheet_cells":100000,"rows_first":2000,"rows_last":500,"rows_between":2000,"halvings":0,"cell_chars":16384,"cell_head_chars":4096},"cells_cut":0,"cells_raw":0,"read":"whole","date_system":"1900"}

{"sheet":"プレシーズンゲーム","index":0,"n_rows":77,"n_cols":8,"rows_kept":77,"cut":false,"hidden":false,"merged":[[44,1,44,7],[67,1,67,7],[68,1,68,7],[75,1,75,7],[76,1,76,7],[14,1,14,7],[17,1,17,7],[32,1,32,7],[33,1,33,7],[41,1,41,3],[41,5,41,7],[9,2,9,7],[0,2,0,5],[1,0,1,7],[2,1,2,3],[4,2,4,5],[6,1,7,7]]}
[null,null,"２０１８年度名古屋地区プレシーズンゲーム",null,null,null,"大会番号　","００５"]
["選手登録は２０１８年１２月２４日までに済ませてください。年明けには登録できません。"]
["１．期  日        ","2019-03-21"]
["２．場  所","パロマ瑞穂スタジアム"]
["３．種  目","（男子）"]
[null,"６０ｍ，３００ｍ,１マイル,１１０ｍＪＨ(0.991m)，４×１００ｍＲ,走高跳AB,走幅跳,"]
{"$rows_left_out":72}
{"sheet":"注意事項","index":1,"n_rows":76,"n_cols":10,"rows_kept":76,"cut":false,"hidden":false,"merged":[[58,4,58,7],[74,3,74,7],[0,0,0,13],[6,1,6,2],[6,3,6,7],[4,2,4,7],[2,9,4,11],[2,2,2,7],[9,1,9,2],[9,3,9,5],[7,1,7,9],[8,1,8,9],[3,2,3,7]]}
["　★データ入力前にこのページの内容を必ずお読みください。"]
[]
[null,"大会名",{"$f":"プレシーズンゲーム!C1","v":"２０１８年度名古屋地区プレシーズンゲーム"},null,null,null,null,null,null,"高校用"]
[null,"期　日",{"$f":"プレシーズンゲーム!B3","v":"2019-03-21"}]
[null,"会　場","パロマ瑞穂スタジアム"]
[]
{"$rows_left_out":71}
{"sheet":"①団体情報入力","index":2,"n_rows":25,"n_cols":15,"rows_kept":25,"cut":false,"hidden":false,"merged":[[3,0,3,1],[3,2,3,4],[3,5,5,9],[4,0,4,1],[9,8,9,11],[4,2,4,4],[5,0,5,1],[5,2,5,4],[6,0,6,1],[6,2,6,4],[0,3,0,11],[1,0,1,1],[1,2,1,4],[1,5,1,11],[2,0,2,1],[2,2,2,4],[2,5,2,11],[12,0,12,3],[12,4,12,7],[12,8,12,9],[7,0,7,1],[7,2,7,4],[8,0,8,1],[8,2,8,4],[9,0,9,1],[10,0,10,7],[10,8,10,9],[11,0,11,3],[11,4,11,7],[11,8,11,9]]}
["①団体情報入力",null,"高校用"]
["団体名検索",null,null,null,null,"←団体名最初の一文字を入力してください。",null,null,null,null,null,null,null,{"$f":"C2","v":0}]
["団体名",null,null,null,null,"←団体名の一部を入力すると、候補がドロップダウンに表示されますので選択してください。",null,null,null,null,null,null,1,{"$f":"VLOOKUP(\"*\"&$N$2&\"*\",Sheet6!D2:F411,1,FALSE)","v":{"$error":"#N/A"}},{"$f":"VLOOKUP(\"*\"&N2&\"*\",Sheet6!B2:F411,5,FALSE)","v":{"$error":"#N/A"}}]
["団体コード",null,{"$f":"IF(C3=\"\",\"\",VLOOKUP(C3,Sheet6!B:C,2,0))","v":""},null,null,"←団体名を選択すると、自動で入力されます。",null,null,null,null,null,null,2,{"$f":"VLOOKUP(\"*\"&$N$2&\"*\",OFFSET(Sheet6!$B$2:$F$411,O3,0),1,FALSE)","v":{"$error":"#N/A"}},{"$f":"VLOOKUP(\"*\"&$N$2&\"*\",OFFSET(Sheet6!$B$2:$F$411,O3,0),5,FALSE)","v":{"$error":"#N/A"}}]
["略称団体名",null,{"$f":"IF(C3=\"\",\"\",C3)","v":""},null,null,null,null,null,null,null,null,null,3,{"$f":"VLOOKUP(\"*\"&$N$2&\"*\",OFFSET(Sheet6!$B$2:$F$411,O4,0),1,FALSE)","v":{"$error":"#N/A"}},{"$f":"VLOOKUP(\"*\"&$N$2&\"*\",OFFSET(Sheet6!$B$2:$F$411,O4,0),5,FALSE)","v":{"$error":"#N/A"}}]
["団体名ﾌﾘｶﾞﾅ",null,{"$f":"IF(C3=\"\",\"\",VLOOKUP(C3,Sheet6!B:E,4,0))","v":""},null,null,null,null,null,null,null,null,null,4,{"$f":"VLOOKUP(\"*\"&$N$2&\"*\",OFFSET(Sheet6!$B$2:$F$411,O5,0),1,FALSE)","v":{"$error":"#N/A"}},{"$f":"VLOOKUP(\"*\"&$N$2&\"*\",OFFSET(Sheet6!$B$2:$F$411,O5,0),5,FALSE)","v":{"$error":"#N/A"}}]
{"$rows_left_out":20}
{"sheet":"②選手情報入力","index":3,"n_rows":105,"n_cols":47,"rows_kept":105,"cut":false,"hidden":false,"merged":[[95,19,95,20],[96,19,96,20],[97,19,97,20],[98,19,98,20],[99,19,99,20],[90,19,90,20],[91,19,91,20],[92,19,92,20],[93,19,93,20],[94,19,94,20],[85,19,85,20],[86,19,86,20],[87,19,87,20],[88,19,88,20],[89,19,89,20],[80,19,80,20],[81,19,81,20],[82,19,82,20],[83,19,83,20],[84,19,84,20],[75,19,75,20],[76,19,76,20],[77,19,77,20],[78,19,78,20],[79,19,79,20],[70,19,70,20],[71,19,71,20],[72,19,72,20],[73,19,73,20],[74,19,74,20],[65,19,65,20],[66,19,66,20],[67,19,67,20],[68,19,68,20],[69,19,69,20],[60,19,60,20],[61,19,61,20],[62,19,62,20],[63,19,63,20],[64,19,64,20],[55,19,55,20],[56,19,56,20],[57,19,57,20],[58,19,58,20],[59,19,59,20],[50,19,50,20],[51,19,51,20],[52,19,52,20],[53,19,53,20],[54,19,54,20],[45,19,45,20],[46,19,46,20],[47,19,47,20],[48,19,48,20],[49,19,49,20],[40,19,40,20],[41,19,41,20],[42,19,42,20],[43,19,43,20],[44,19,44,20],[35,19,35,20],[36,19,36,20],[37,19,37,20],[38,19,38,20],[39,19,39,20],[30,19,30,20],[31,19,31,20],[32,19,32,20],[33,19,33,20],[34,19,34,20],[25,19,25,20],[26,19,26,20],[27,19,27,20],[28,19,28,20],[29,19,29,20],[20,19,20,20],[21,19,21,20],[22,19,22,20],[23,19,23,20],[24,19,24,20],[97,17,97,18],[98,17,98,18],[99,17,99,18],[3,17,3,18],[8,19,8,20],[9,19,9,20],[10,19,10,20],[11,19,11,20],[12,19,12,20],[13,19,13,20],[14,19,14,20],[15,19,15,20],[16,19,16,20],[17,19,17,20],[18,19,18,20],[19,19,19,20],[92,17,92,18],[93,17,93,18],[94,17,94,18],[95,17,95,18],[96,17,96,18],[87,17,87,18],[88,17,88,18],[89,17,89,18],[90,17,90,18],[91,17,91,18],[82,17,82,18],[83,17,83,18],[84,17,84,18],[85,17,85,18],[86,17,86,18],[77,17,77,18],[78,17,78,18],[79,17,79,18],[80,17,80,18],[81,17,81,18],[72,17,72,18],[73,17,73,18],[74,17,74,18],[75,17,75,18],[76,17,76,18],[67,17,67,18],[68,17,68,18],[69,17,69,18],[70,17,70,18],[71,17,71,18],[62,17,62,18],[63,17,63,18],[64,17,64,18],[65,17,65,18],[66,17,66,18],[57,17,57,18],[58,17,58,18],[59,17,59,18],[60,17,60,18],[61,17,61,18],[52,17,52,18],[53,17,53,18],[54,17,54,18],[55,17,55,18],[56,17,56,18],[47,17,47,18],[48,17,48,18],[49,17,49,18],[50,17,50,18],[51,17,51,18],[42,17,42,18],[43,17,43,18],[44,17,44,18],[45,17,45,18],[46,17,46,18],[37,17,37,18],[38,17,38,18],[39,17,39,18],[40,17,40,18],[41,17,41,18],[32,17,32,18],[33,17,33,18],[34,17,34,18],[35,17,35,18],[36,17,36,18],[27,17,27,18],[28,17,28,18],[29,17,29,18],[30,17,30,18],[31,17,31,18],[22,17,22,18],[23,17,23,18],[24,17,24,18],[25,17,25,18],[26,17,26,18],[17,17,17,18],[18,17,18,18],[19,17,19,18],[20,17,20,18],[21,17,21,18],[8,1,8,2],[12,17,12,18],[13,17,13,18],[14,17,14,18],[15,17,15,18],[16,17,16,18],[2,16,2,20],[8,17,8,18],[9,17,9,18],[10,17,10,18],[11,17,11,18],[3,19,3,20],[3,16,4,16]]}
["③選手情報入力",null,null,null,{"$f":"IF(①団体情報入力!D5=\"\",\"\",①団体情報入力!D5)","v":""}]
[null,null,"絶対に、行を空けて入力しないでください。"]
[null,null,"※必要事項を全て入力してください。",null,null,null,null,null,null,null,null,null,null,null,null,null,"リレー記録"]
[null,null,"※リレー種目にエントリーをする場合は○を選択し、「③リレー情報確認」でメンバーを確認してください。",null,null,null,null,null,null,null,null,null,null,null,null,null,null,"4X100mR",null,"4X400mR"]
[null,null,"※ナンバーを入力してもリレーメンバーが反映されない場合、ナンバーのセルが文字列になっています。",null,null,null,null,null,null,null,null,null,null,null,null,null,null,"OP","記録","OP","記録"]
[null,null,"※コピーしたデータを貼り付ける場合は、「形式を選択して貼り付け」から「値」で貼り付けてください。",null,null,null,null,null,null,null,null,null,null,null,null,null,"男子"]
{"$rows_left_out":100}
{"sheet":"③リレー情報確認","index":4,"n_rows":14,"n_cols":24,"rows_kept":14,"cut":false,"hidden":false,"merged":[[0,9,0,11],[7,17,12,17],[7,5,12,5],[5,1,5,5],[7,23,12,23],[5,13,5,17],[5,19,5,23],[5,7,5,11],[7,11,12,11],[0,15,0,17]]}
["④リレー情報確認",null,null,null,null,null,null,null,"チーム名 ",{"$f":"IF(①団体情報入力!D5=\"\",\"\",①団体情報入力!D5)","v":""},null,null,null,null,"ｶﾅ",{"$f":"IF(①団体情報入力!D6=\"\",\"\",①団体情報入力!D6)","v":""}]
[]
[null,null,"※リレーにエントリーをする選手とチームの記録を確認してください。"]
[null,null,"※修正をする場合は「②選手情報入力」で修正してください。"]
[null,null,"※リレーエントリーに○を付けても、データが反映されない場合、「②選手権情報入力」のナンバーのセルが文字列になっていますので数値に変換してください。"]
[null,"男4X100mR",null,null,null,null,null,"男4X400mR",null,null,null,null,null,"女4X100mR",null,null,null,null,null,"女4X400mR"]
{"$rows_left_out":9}
{"sheet":"④種目別人数","index":5,"n_rows":16,"n_cols":14,"rows_kept":16,"cut":false,"hidden":false,"merged":[[13,5,13,6],[6,1,6,2],[6,5,6,6],[13,2,13,4],[7,2,7,3],[12,2,12,4],[11,1,11,4],[8,2,8,3],[1,0,1,7],[3,0,3,7],[2,0,2,4],[5,3,5,6],[4,2,4,5]]}
["⑤種目別人数一覧表"]
["※種目数・参加料等を確認してから印刷をしてください。"]
[{"$f":"注意事項!C3","v":"２０１８年度名古屋地区プレシーズンゲーム"},null,null,null,null,null,{"$f":"IF(①団体情報入力!D3=\"\",\"\",①団体情報入力!D3)","v":""}]
["種目別申込人数一覧表"]
[null,"申込責任者",{"$f":"IF(①団体情報入力!C7=\"\",\"\",①団体情報入力!C7)","v":""},null,null,null,"A4サイズ"]
[null,{"$f":"IF(①団体情報入力!C8=\"\",\"\",①団体情報入力!C8)","v":""},"学校名",{"$f":"IF(①団体情報入力!C5=\"\",\"\",①団体情報入力!C5)","v":""}]
{"$rows_left_out":11}
{"sheet":"　　　　　","index":6,"n_rows":0,"n_cols":0,"rows_kept":0,"cut":false,"hidden":false,"merged":[]}

{"sheet":"種目情報","index":7,"n_rows":48,"n_cols":15,"rows_kept":48,"cut":false,"hidden":false,"merged":[[3,12,28,12],[30,12,50,12],[1,13,1,14],[0,0,0,2],[0,4,0,6],[0,8,0,10],[1,0,2,0],[1,4,2,4],[1,8,2,8]]}
["男子",null,null,null,"女子",null,null,null,"リレー"]
["種目","種目","記録",null,"種目","種目","記録",null,"種目","種目","記録",null,null,"一覧表用　種目名"]
[null,"No","FLAG",null,null,"No","FLAG",null,null,"No","FLAG"]
["男60m",1,2,null,"女60m",14,2,null,"男子4X100mR",24,2,null,"男　　　子","男100m","男100m"]
["男300m",2,2,null,"女300m",15,2,null,null,null,null,null,null,"男200m","男200m"]
["男1マイル",3,2,null,"女1マイル",16,2,null,"女子4X100mR",25,2,null,null,"男400m","男400m"]
{"$rows_left_out":43}
{"sheet":"data_kyogisha","index":8,"n_rows":91,"n_cols":34,"rows_kept":91,"cut":false,"hidden":false,"merged":[]}
["競技者NO","所属コード1","所属コード2","ナンバー","ナンバー2","競技者名","競技者名カナ","競技者名略称","性別","学年","生年","月日","個人所属地名","陸連コード","参加競技-競技コード1","参加競技-自己記録1","参加競技-オープン参加FLG1","参加競技-記録FLG1","参加競技-競技コード2","参加競技-自己記録2","参加競技-オープン参加FLG2","参加競技-記録FLG2","参加競技-競技コード3","参加競技-自己記録3","参加競技-オープン参加FLG3","参加競技-記録FLG3","参加競技-競技コード4","参加競技-自己記録4","参加競技-オープン参加FLG4","参加競技-記録FLG4","参加競技-競技コード5","参加競技-自己記録5","参加競技-オープン参加FLG5","参加競技-記録FLG5"]
[{"$f":"IF(E2=\"\",\"\",Sheet1!A1)","v":""},{"$f":"IF(E2=\"\",\"\",①団体情報入力!$C$4)","v":""},null,{"$f":"IF(②選手情報入力!B11=\"\",\"\",②選手情報入力!B11)","v":""},{"$f":"IF(②選手情報入力!C11=\"\",\"\",②選手情報入力!C11)","v":""},{"$f":"IF(E2=\"\",\"\",②選手情報入力!D11)","v":""},{"$f":"IF(E2=\"\",\"\",ASC(②選手情報入力!E11))","v":""},{"$f":"IF(E2=\"\",\"\",F2)","v":""},{"$f":"IF(E2=\"\",\"\",IF(②選手情報入力!G11=\"男\",1,2))","v":""},{"$f":"IF(E2=\"\",\"\",IF(②選手情報入力!H11=\"\",\"\",②選手情報入力!H11))","v":""},null,null,{"$f":"IF(E2=\"\",\"\",\"愛知\")","v":""},null,{"$f":"IF(E2=\"\",\"\",IF(②選手情報入力!J11=\"\",\"\",IF(I2=1,VLOOKUP(②選手情報入力!J11,種目情報!$A$4:$B$32,2,FALSE),VLOOKUP(②選手情報入力!J11,種目情報!$E$4:$F$34,2,FALSE))))","v":""},{"$f":"IF(E2=\"\",\"\",IF(②選手情報入力!K11=\"\",\"\",②選手情報入力!K11))","v":""},{"$f":"IF(E2=\"\",\"\",IF(②選手情報入力!I11=\"\",\"\",1))","v":""},{"$f":"IF(E2=\"\",\"\",IF(②選手情報入力!J11=\"\",\"\",IF(I2=1,VLOOKUP(②選手情報入力!J11,種目情報!$A$4:$C$36,3,FALSE),VLOOKUP(②選手情報入力!J11,種目情報!$E$4:$G$39,3,FALSE))))","v":""},{"$f":"IF(E2=\"\",\"\",IF(②選手情報入力!M11=\"\",\"\",IF(I2=1,VLOOKUP(②選手情報入力!M11,種目情報!$A$4:$B$36,2,FALSE),VLOOKUP(②選手情報入力!M11,種目情報!$E$4:$F$39,2,FALSE))))","v":""},{"$f":"IF(E2=\"\",\"\",IF(②選手情報入力!N11=\"\",\"\",②選手情報入力!N11))","v":""},{"$f":"IF(E2=\"\",\"\",IF(②選手情報入力!L11=\"\",\"\",1))","v":""},{"$f":"IF(E2=\"\",\"\",IF(②選手情報入力!M11=\"\",\"\",IF(I2=1,VLOOKUP(②選手情報入力!M11,種目情報!$A$4:$C$36,3,FALSE),VLOOKUP(②選手情報入力!M11,種目情報!$E$4:$G$39,3,FALSE))))","v":""},{"$f":"IF(E2=\"\",\"\",IF(②選手情報入力!P11=\"\",\"\",IF(I2=1,VLOOKUP(②選手情報入力!P11,種目情報!$A$4:$B$36,2,FALSE),VLOOKUP(②選手情報入力!P11,種目情報!$E$4:$F$39,2,FALSE))))","v":""},{"$f":"IF(E2=\"\",\"\",IF(②選手情報入力!Q11=\"\",\"\",②選手情報入力!Q11))","v":""},{"$f":"IF(E2=\"\",\"\",IF(②選手情報入力!O11=\"\",\"\",1))","v":""},{"$f":"IF(E2=\"\",\"\",IF(②選手情報入力!P11=\"\",\"\",IF(I2=1,VLOOKUP(②選手情報入力!P11,種目情報!$A$4:$C$36,3,FALSE),VLOOKUP(②選手情報入力!P11,種目情報!$E$4:$G$39,3,FALSE))))","v":""},{"$f":"IF(E2=\"\",\"\",IF(②選手情報入力!R11=\"\",\"\",IF(I2=1,種目情報!$J$4,種目情報!$J$6)))","v":""},{"$f":"IF(E2=\"\",\"\",IF(②選手情報入力!R11=\"\",\"\",IF(I2=1,IF(②選手情報入力!$S$6=\"\",\"\",②選手情報入力!$S$6),IF(②選手情報入力!$S$7=\"\",\"\",②選手情報入力!$S$7))))","v":""},{"$f":"IF(E2=\"\",\"\",IF(②選手情報入力!R11=\"\",\"\",IF(I2=1,IF(②選手情報入力!$R$6=\"\",0,1),IF(②選手情報入力!$R$7=\"\",0,1))))","v":""},{"$f":"IF(E2=\"\",\"\",IF(②選手情報入力!R11=\"\",\"\",2))","v":""},{"$f":"IF(E2=\"\",\"\",IF(②選手情報入力!T11=\"\",\"\",IF(I2=1,種目情報!$J$5,種目情報!$J$7)))","v":""},{"$f":"IF(E2=\"\",\"\",IF(②選手情報入力!T11=\"\",\"\",IF(I2=1,IF(②選手情報入力!$U$6=\"\",\"\",②選手情報入力!$U$6),IF(②選手情報入力!$U$7=\"\",\"\",②選手情報入力!$U$7))))","v":""},{"$f":"IF(E2=\"\",\"\",IF(②選手情報入力!T11=\"\",\"\",IF(I2=1,IF(②選手情報入力!$T$6=\"\",0,1),IF(②選手情報入力!$T$7=\"\",0,1))))","v":""},{"$f":"IF(E2=\"\",\"\",IF(②選手情報入力!T11=\"\",\"\",2))","v":""}]
[{"$f":"IF(E3=\"\",\"\",Sheet1!A2)","v":""},{"$f":"IF(E3=\"\",\"\",①団体情報入力!$C$4)","v":""},null,{"$f":"IF(②選手情報入力!B12=\"\",\"\",②選手情報入力!B12)","v":""},{"$f":"IF(②選手情報入力!C12=\"\",\"\",②選手情報入力!C12)","v":""},{"$f":"IF(E3=\"\",\"\",②選手情報入力!D12)","v":""},{"$f":"IF(E3=\"\",\"\",ASC(②選手情報入力!E12))","v":""},{"$f":"IF(E3=\"\",\"\",F3)","v":""},{"$f":"IF(E3=\"\",\"\",IF(②選手情報入力!G12=\"男\",1,2))","v":""},{"$f":"IF(E3=\"\",\"\",IF(②選手情報入力!H12=\"\",\"\",②選手情報入力!H12))","v":""},null,null,{"$f":"IF(E3=\"\",\"\",\"愛知\")","v":""},null,{"$f":"IF(E3=\"\",\"\",IF(②選手情報入力!J12=\"\",\"\",IF(I3=1,VLOOKUP(②選手情報入力!J12,種目情報!$A$4:$B$32,2,FALSE),VLOOKUP(②選手情報入力!J12,種目情報!$E$4:$F$34,2,FALSE))))","v":""},{"$f":"IF(E3=\"\",\"\",IF(②選手情報入力!K12=\"\",\"\",②選手情報入力!K12))","v":""},{"$f":"IF(E3=\"\",\"\",IF(②選手情報入力!I12=\"\",\"\",1))","v":""},{"$f":"IF(E3=\"\",\"\",IF(②選手情報入力!J12=\"\",\"\",IF(I3=1,VLOOKUP(②選手情報入力!J12,種目情報!$A$4:$C$36,3,FALSE),VLOOKUP(②選手情報入力!J12,種目情報!$E$4:$G$39,3,FALSE))))","v":""},{"$f":"IF(E3=\"\",\"\",IF(②選手情報入力!M12=\"\",\"\",IF(I3=1,VLOOKUP(②選手情報入力!M12,種目情報!$A$4:$B$36,2,FALSE),VLOOKUP(②選手情報入力!M12,種目情報!$E$4:$F$39,2,FALSE))))","v":""},{"$f":"IF(E3=\"\",\"\",IF(②選手情報入力!N12=\"\",\"\",②選手情報入力!N12))","v":""},{"$f":"IF(E3=\"\",\"\",IF(②選手情報入力!L12=\"\",\"\",1))","v":""},{"$f":"IF(E3=\"\",\"\",IF(②選手情報入力!M12=\"\",\"\",IF(I3=1,VLOOKUP(②選手情報入力!M12,種目情報!$A$4:$C$36,3,FALSE),VLOOKUP(②選手情報入力!M12,種目情報!$E$4:$G$39,3,FALSE))))","v":""},{"$f":"IF(E3=\"\",\"\",IF(②選手情報入力!P12=\"\",\"\",IF(I3=1,VLOOKUP(②選手情報入力!P12,種目情報!$A$4:$B$36,2,FALSE),VLOOKUP(②選手情報入力!P12,種目情報!$E$4:$F$39,2,FALSE))))","v":""},{"$f":"IF(E3=\"\",\"\",IF(②選手情報入力!Q12=\"\",\"\",②選手情報入力!Q12))","v":""},{"$f":"IF(E3=\"\",\"\",IF(②選手情報入力!O12=\"\",\"\",1))","v":""},{"$f":"IF(E3=\"\",\"\",IF(②選手情報入力!P12=\"\",\"\",IF(I3=1,VLOOKUP(②選手情報入力!P12,種目情報!$A$4:$C$36,3,FALSE),VLOOKUP(②選手情報入力!P12,種目情報!$E$4:$G$39,3,FALSE))))","v":""},{"$f":"IF(E3=\"\",\"\",IF(②選手情報入力!R12=\"\",\"\",IF(I3=1,種目情報!$J$4,種目情報!$J$6)))","v":""},{"$f":"IF(E3=\"\",\"\",IF(②選手情報入力!R12=\"\",\"\",IF(I3=1,IF(②選手情報入力!$S$6=\"\",\"\",②選手情報入力!$S$6),IF(②選手情報入力!$S$7=\"\",\"\",②選手情報入力!$S$7))))","v":""},{"$f":"IF(E3=\"\",\"\",IF(②選手情報入力!R12=\"\",\"\",IF(I3=1,IF(②選手情報入力!$R$6=\"\",0,1),IF(②選手情報入力!$R$7=\"\",0,1))))","v":""},{"$f":"IF(E3=\"\",\"\",IF(②選手情報入力!R12=\"\",\"\",2))","v":""},{"$f":"IF(E3=\"\",\"\",IF(②選手情報入力!T12=\"\",\"\",IF(I3=1,種目情報!$J$5,種目情報!$J$7)))","v":""},{"$f":"IF(E3=\"\",\"\",IF(②選手情報入力!T12=\"\",\"\",IF(I3=1,IF(②選手情報入力!$U$6=\"\",\"\",②選手情報入力!$U$6),IF(②選手情報入力!$U$7=\"\",\"\",②選手情報入力!$U$7))))","v":""},{"$f":"IF(E3=\"\",\"\",IF(②選手情報入力!T12=\"\",\"\",IF(I3=1,IF(②選手情報入力!$T$6=\"\",0,1),IF(②選手情報入力!$T$7=\"\",0,1))))","v":""},{"$f":"IF(E3=\"\",\"\",IF(②選手情報入力!T12=\"\",\"\",2))","v":""}]
[{"$f":"IF(E4=\"\",\"\",Sheet1!A3)","v":""},{"$f":"IF(E4=\"\",\"\",①団体情報入力!$C$4)","v":""},null,{"$f":"IF(②選手情報入力!B13=\"\",\"\",②選手情報入力!B13)","v":""},{"$f":"IF(②選手情報入力!C13=\"\",\"\",②選手情報入力!C13)","v":""},{"$f":"IF(E4=\"\",\"\",②選手情報入力!D13)","v":""},{"$f":"IF(E4=\"\",\"\",ASC(②選手情報入力!E13))","v":""},"",{"$f":"IF(E4=\"\",\"\",IF(②選手情報入力!G13=\"男\",1,2))","v":""},{"$f":"IF(E4=\"\",\"\",IF(②選手情報入力!H13=\"\",\"\",②選手情報入力!H13))","v":""},null,null,"",null,{"$f":"IF(E4=\"\",\"\",IF(②選手情報入力!J13=\"\",\"\",IF(I4=1,VLOOKUP(②選手情報入力!J13,種目情報!$A$4:$B$32,2,FALSE),VLOOKUP(②選手情報入力!J13,種目情報!$E$4:$F$34,2,FALSE))))","v":""},{"$f":"IF(E4=\"\",\"\",IF(②選手情報入力!K13=\"\",\"\",②選手情報入力!K13))","v":""},{"$f":"IF(E4=\"\",\"\",IF(②選手情報入力!I13=\"\",\"\",1))","v":""},{"$f":"IF(E4=\"\",\"\",IF(②選手情報入力!J13=\"\",\"\",IF(I4=1,VLOOKUP(②選手情報入力!J13,種目情報!$A$4:$C$36,3,FALSE),VLOOKUP(②選手情報入力!J13,種目情報!$E$4:$G$39,3,FALSE))))","v":""},{"$f":"IF(E4=\"\",\"\",IF(②選手情報入力!M13=\"\",\"\",IF(I4=1,VLOOKUP(②選手情報入力!M13,種目情報!$A$4:$B$36,2,FALSE),VLOOKUP(②選手情報入力!M13,種目情報!$E$4:$F$39,2,FALSE))))","v":""},{"$f":"IF(E4=\"\",\"\",IF(②選手情報入力!N13=\"\",\"\",②選手情報入力!N13))","v":""},{"$f":"IF(E4=\"\",\"\",IF(②選手情報入力!L13=\"\",\"\",1))","v":""},{"$f":"IF(E4=\"\",\"\",IF(②選手情報入力!M13=\"\",\"\",IF(I4=1,VLOOKUP(②選手情報入力!M13,種目情報!$A$4:$C$36,3,FALSE),VLOOKUP(②選手情報入力!M13,種目情報!$E$4:$G$39,3,FALSE))))","v":""},{"$f":"IF(E4=\"\",\"\",IF(②選手情報入力!P13=\"\",\"\",IF(I4=1,VLOOKUP(②選手情報入力!P13,種目情報!$A$4:$B$36,2,FALSE),VLOOKUP(②選手情報入力!P13,種目情報!$E$4:$F$39,2,FALSE))))","v":""},{"$f":"IF(E4=\"\",\"\",IF(②選手情報入力!Q13=\"\",\"\",②選手情報入力!Q13))","v":""},{"$f":"IF(E4=\"\",\"\",IF(②選手情報入力!O13=\"\",\"\",1))","v":""},{"$f":"IF(E4=\"\",\"\",IF(②選手情報入力!P13=\"\",\"\",IF(I4=1,VLOOKUP(②選手情報入力!P13,種目情報!$A$4:$C$36,3,FALSE),VLOOKUP(②選手情報入力!P13,種目情報!$E$4:$G$39,3,FALSE))))","v":""},{"$f":"IF(E4=\"\",\"\",IF(②選手情報入力!R13=\"\",\"\",IF(I4=1,種目情報!$J$4,種目情報!$J$6)))","v":""},{"$f":"IF(E4=\"\",\"\",IF(②選手情報入力!R13=\"\",\"\",IF(I4=1,IF(②選手情報入力!$S$6=\"\",\"\",②選手情報入力!$S$6),IF(②選手情報入力!$S$7=\"\",\"\",②選手情報入力!$S$7))))","v":""},{"$f":"IF(E4=\"\",\"\",IF(②選手情報入力!R13=\"\",\"\",IF(I4=1,IF(②選手情報入力!$R$6=\"\",0,1),IF(②選手情報入力!$R$7=\"\",0,1))))","v":""},{"$f":"IF(E4=\"\",\"\",IF(②選手情報入力!R13=\"\",\"\",2))","v":""},{"$f":"IF(E4=\"\",\"\",IF(②選手情報入力!T13=\"\",\"\",IF(I4=1,種目情報!$J$5,種目情報!$J$7)))","v":""},{"$f":"IF(E4=\"\",\"\",IF(②選手情報入力!T13=\"\",\"\",IF(I4=1,IF(②選手情報入力!$U$6=\"\",\"\",②選手情報入力!$U$6),IF(②選手情報入力!$U$7=\"\",\"\",②選手情報入力!$U$7))))","v":""},{"$f":"IF(E4=\"\",\"\",IF(②選手情報入力!T13=\"\",\"\",IF(I4=1,IF(②選手情報入力!$T$6=\"\",0,1),IF(②選手情報入力!$T$7=\"\",0,1))))","v":""},{"$f":"IF(E4=\"\",\"\",IF(②選手情報入力!T13=\"\",\"\",2))","v":""}]
[{"$f":"IF(E5=\"\",\"\",Sheet1!A4)","v":""},{"$f":"IF(E5=\"\",\"\",①団体情報入力!$C$4)","v":""},null,{"$f":"IF(②選手情報入力!B14=\"\",\"\",②選手情報入力!B14)","v":""},{"$f":"IF(②選手情報入力!C14=\"\",\"\",②選手情報入力!C14)","v":""},{"$f":"IF(E5=\"\",\"\",②選手情報入力!D14)","v":""},{"$f":"IF(E5=\"\",\"\",ASC(②選手情報入力!E14))","v":""},"",{"$f":"IF(E5=\"\",\"\",IF(②選手情報入力!G14=\"男\",1,2))","v":""},{"$f":"IF(E5=\"\",\"\",IF(②選手情報入力!H14=\"\",\"\",②選手情報入力!H14))","v":""},null,null,"",null,{"$f":"IF(E5=\"\",\"\",IF(②選手情報入力!J14=\"\",\"\",IF(I5=1,VLOOKUP(②選手情報入力!J14,種目情報!$A$4:$B$32,2,FALSE),VLOOKUP(②選手情報入力!J14,種目情報!$E$4:$F$34,2,FALSE))))","v":""},{"$f":"IF(E5=\"\",\"\",IF(②選手情報入力!K14=\"\",\"\",②選手情報入力!K14))","v":""},{"$f":"IF(E5=\"\",\"\",IF(②選手情報入力!I14=\"\",\"\",1))","v":""},{"$f":"IF(E5=\"\",\"\",IF(②選手情報入力!J14=\"\",\"\",IF(I5=1,VLOOKUP(②選手情報入力!J14,種目情報!$A$4:$C$36,3,FALSE),VLOOKUP(②選手情報入力!J14,種目情報!$E$4:$G$39,3,FALSE))))","v":""},{"$f":"IF(E5=\"\",\"\",IF(②選手情報入力!M14=\"\",\"\",IF(I5=1,VLOOKUP(②選手情報入力!M14,種目情報!$A$4:$B$36,2,FALSE),VLOOKUP(②選手情報入力!M14,種目情報!$E$4:$F$39,2,FALSE))))","v":""},{"$f":"IF(E5=\"\",\"\",IF(②選手情報入力!N14=\"\",\"\",②選手情報入力!N14))","v":""},{"$f":"IF(E5=\"\",\"\",IF(②選手情報入力!L14=\"\",\"\",1))","v":""},{"$f":"IF(E5=\"\",\"\",IF(②選手情報入力!M14=\"\",\"\",IF(I5=1,VLOOKUP(②選手情報入力!M14,種目情報!$A$4:$C$36,3,FALSE),VLOOKUP(②選手情報入力!M14,種目情報!$E$4:$G$39,3,FALSE))))","v":""},{"$f":"IF(E5=\"\",\"\",IF(②選手情報入力!P14=\"\",\"\",IF(I5=1,VLOOKUP(②選手情報入力!P14,種目情報!$A$4:$B$36,2,FALSE),VLOOKUP(②選手情報入力!P14,種目情報!$E$4:$F$39,2,FALSE))))","v":""},{"$f":"IF(E5=\"\",\"\",IF(②選手情報入力!Q14=\"\",\"\",②選手情報入力!Q14))","v":""},{"$f":"IF(E5=\"\",\"\",IF(②選手情報入力!O14=\"\",\"\",1))","v":""},{"$f":"IF(E5=\"\",\"\",IF(②選手情報入力!P14=\"\",\"\",IF(I5=1,VLOOKUP(②選手情報入力!P14,種目情報!$A$4:$C$36,3,FALSE),VLOOKUP(②選手情報入力!P14,種目情報!$E$4:$G$39,3,FALSE))))","v":""},{"$f":"IF(E5=\"\",\"\",IF(②選手情報入力!R14=\"\",\"\",IF(I5=1,種目情報!$J$4,種目情報!$J$6)))","v":""},{"$f":"IF(E5=\"\",\"\",IF(②選手情報入力!R14=\"\",\"\",IF(I5=1,IF(②選手情報入力!$S$6=\"\",\"\",②選手情報入力!$S$6),IF(②選手情報入力!$S$7=\"\",\"\",②選手情報入力!$S$7))))","v":""},{"$f":"IF(E5=\"\",\"\",IF(②選手情報入力!R14=\"\",\"\",IF(I5=1,IF(②選手情報入力!$R$6=\"\",0,1),IF(②選手情報入力!$R$7=\"\",0,1))))","v":""},{"$f":"IF(E5=\"\",\"\",IF(②選手情報入力!R14=\"\",\"\",2))","v":""},{"$f":"IF(E5=\"\",\"\",IF(②選手情報入力!T14=\"\",\"\",IF(I5=1,種目情報!$J$5,種目情報!$J$7)))","v":""},{"$f":"IF(E5=\"\",\"\",IF(②選手情報入力!T14=\"\",\"\",IF(I5=1,IF(②選手情報入力!$U$6=\"\",\"\",②選手情報入力!$U$6),IF(②選手情報入力!$U$7=\"\",\"\",②選手情報入力!$U$7))))","v":""},{"$f":"IF(E5=\"\",\"\",IF(②選手情報入力!T14=\"\",\"\",IF(I5=1,IF(②選手情報入力!$T$6=\"\",0,1),IF(②選手情報入力!$T$7=\"\",0,1))))","v":""},{"$f":"IF(E5=\"\",\"\",IF(②選手情報入力!T14=\"\",\"\",2))","v":""}]
[{"$f":"IF(E6=\"\",\"\",Sheet1!A5)","v":""},{"$f":"IF(E6=\"\",\"\",①団体情報入力!$C$4)","v":""},null,{"$f":"IF(②選手情報入力!B15=\"\",\"\",②選手情報入力!B15)","v":""},{"$f":"IF(②選手情報入力!C15=\"\",\"\",②選手情報入力!C15)","v":""},{"$f":"IF(E6=\"\",\"\",②選手情報入力!D15)","v":""},{"$f":"IF(E6=\"\",\"\",ASC(②選手情報入力!E15))","v":""},"",{"$f":"IF(E6=\"\",\"\",IF(②選手情報入力!G15=\"男\",1,2))","v":""},{"$f":"IF(E6=\"\",\"\",IF(②選手情報入力!H15=\"\",\"\",②選手情報入力!H15))","v":""},null,null,"",null,{"$f":"IF(E6=\"\",\"\",IF(②選手情報入力!J15=\"\",\"\",IF(I6=1,VLOOKUP(②選手情報入力!J15,種目情報!$A$4:$B$32,2,FALSE),VLOOKUP(②選手情報入力!J15,種目情報!$E$4:$F$34,2,FALSE))))","v":""},{"$f":"IF(E6=\"\",\"\",IF(②選手情報入力!K15=\"\",\"\",②選手情報入力!K15))","v":""},{"$f":"IF(E6=\"\",\"\",IF(②選手情報入力!I15=\"\",\"\",1))","v":""},{"$f":"IF(E6=\"\",\"\",IF(②選手情報入力!J15=\"\",\"\",IF(I6=1,VLOOKUP(②選手情報入力!J15,種目情報!$A$4:$C$36,3,FALSE),VLOOKUP(②選手情報入力!J15,種目情報!$E$4:$G$39,3,FALSE))))","v":""},{"$f":"IF(E6=\"\",\"\",IF(②選手情報入力!M15=\"\",\"\",IF(I6=1,VLOOKUP(②選手情報入力!M15,種目情報!$A$4:$B$36,2,FALSE),VLOOKUP(②選手情報入力!M15,種目情報!$E$4:$F$39,2,FALSE))))","v":""},{"$f":"IF(E6=\"\",\"\",IF(②選手情報入力!N15=\"\",\"\",②選手情報入力!N15))","v":""},{"$f":"IF(E6=\"\",\"\",IF(②選手情報入力!L15=\"\",\"\",1))","v":""},{"$f":"IF(E6=\"\",\"\",IF(②選手情報入力!M15=\"\",\"\",IF(I6=1,VLOOKUP(②選手情報入力!M15,種目情報!$A$4:$C$36,3,FALSE),VLOOKUP(②選手情報入力!M15,種目情報!$E$4:$G$39,3,FALSE))))","v":""},{"$f":"IF(E6=\"\",\"\",IF(②選手情報入力!P15=\"\",\"\",IF(I6=1,VLOOKUP(②選手情報入力!P15,種目情報!$A$4:$B$36,2,FALSE),VLOOKUP(②選手情報入力!P15,種目情報!$E$4:$F$39,2,FALSE))))","v":""},{"$f":"IF(E6=\"\",\"\",IF(②選手情報入力!Q15=\"\",\"\",②選手情報入力!Q15))","v":""},{"$f":"IF(E6=\"\",\"\",IF(②選手情報入力!O15=\"\",\"\",1))","v":""},{"$f":"IF(E6=\"\",\"\",IF(②選手情報入力!P15=\"\",\"\",IF(I6=1,VLOOKUP(②選手情報入力!P15,種目情報!$A$4:$C$36,3,FALSE),VLOOKUP(②選手情報入力!P15,種目情報!$E$4:$G$39,3,FALSE))))","v":""},{"$f":"IF(E6=\"\",\"\",IF(②選手情報入力!R15=\"\",\"\",IF(I6=1,種目情報!$J$4,種目情報!$J$6)))","v":""},{"$f":"IF(E6=\"\",\"\",IF(②選手情報入力!R15=\"\",\"\",IF(I6=1,IF(②選手情報入力!$S$6=\"\",\"\",②選手情報入力!$S$6),IF(②選手情報入力!$S$7=\"\",\"\",②選手情報入力!$S$7))))","v":""},{"$f":"IF(E6=\"\",\"\",IF(②選手情報入力!R15=\"\",\"\",IF(I6=1,IF(②選手情報入力!$R$6=\"\",0,1),IF(②選手情報入力!$R$7=\"\",0,1))))","v":""},{"$f":"IF(E6=\"\",\"\",IF(②選手情報入力!R15=\"\",\"\",2))","v":""},{"$f":"IF(E6=\"\",\"\",IF(②選手情報入力!T15=\"\",\"\",IF(I6=1,種目情報!$J$5,種目情報!$J$7)))","v":""},{"$f":"IF(E6=\"\",\"\",IF(②選手情報入力!T15=\"\",\"\",IF(I6=1,IF(②選手情報入力!$U$6=\"\",\"\",②選手情報入力!$U$6),IF(②選手情報入力!$U$7=\"\",\"\",②選手情報入力!$U$7))))","v":""},{"$f":"IF(E6=\"\",\"\",IF(②選手情報入力!T15=\"\",\"\",IF(I6=1,IF(②選手情報入力!$T$6=\"\",0,1),IF(②選手情報入力!$T$7=\"\",0,1))))","v":""},{"$f":"IF(E6=\"\",\"\",IF(②選手情報入力!T15=\"\",\"\",2))","v":""}]
{"$rows_left_out":86}
{"sheet":"data_team","index":9,"n_rows":25,"n_cols":13,"rows_kept":25,"cut":false,"hidden":false,"merged":[]}
["チームNO","所属コード","チーム名","チーム名カナ","チーム名略称","チーム正式名称","ID","競技者NO","競技者名","参加競技-競技コード","参加競技-自己記録","参加競技-オープン参加FLG","参加競技-記録FLG"]
[{"$f":"IF(③リレー情報確認!C8=\"\",\"\",410000+①団体情報入力!$D$4*10)","v":""},{"$f":"IF(A2=\"\",\"\",①団体情報入力!$D$4)","v":""},{"$f":"IF(A2=\"\",\"\",③リレー情報確認!$J$1)","v":""},{"$f":"IF(A2=\"\",\"\",③リレー情報確認!$P$1)","v":""},null,null,1,{"$f":"IF(A2=\"\",\"\",③リレー情報確認!E8)","v":""},{"$f":"IF(A2=\"\",\"\",③リレー情報確認!D8)","v":""},{"$f":"IF(A2=\"\",\"\",種目情報!$J$4)","v":""},{"$f":"IF(A2=\"\",\"\",③リレー情報確認!$F$8)","v":""},{"$f":"IF(A2=\"\",\"\",IF(②選手情報入力!$R$6=\"\",0,1))","v":""},{"$f":"IF(A2=\"\",\"\",種目情報!$K$4)","v":""}]
[{"$f":"IF(③リレー情報確認!C9=\"\",\"\",410000+①団体情報入力!$D$4*10)","v":""},{"$f":"IF(A3=\"\",\"\",①団体情報入力!$D$4)","v":""},{"$f":"IF(A3=\"\",\"\",③リレー情報確認!$J$1)","v":""},{"$f":"IF(A3=\"\",\"\",③リレー情報確認!$P$1)","v":""},null,null,2,{"$f":"IF(A3=\"\",\"\",③リレー情報確認!E9)","v":""},{"$f":"IF(A3=\"\",\"\",③リレー情報確認!D9)","v":""},{"$f":"IF(A3=\"\",\"\",種目情報!$J$4)","v":""},{"$f":"IF(A3=\"\",\"\",③リレー情報確認!$F$8)","v":""},{"$f":"IF(A3=\"\",\"\",IF(②選手情報入力!$R$6=\"\",0,1))","v":""},{"$f":"IF(A3=\"\",\"\",種目情報!$K$4)","v":""}]
[{"$f":"IF(③リレー情報確認!C10=\"\",\"\",410000+①団体情報入力!$D$4*10)","v":""},{"$f":"IF(A4=\"\",\"\",①団体情報入力!$D$4)","v":""},{"$f":"IF(A4=\"\",\"\",③リレー情報確認!$J$1)","v":""},{"$f":"IF(A4=\"\",\"\",③リレー情報確認!$P$1)","v":""},null,null,3,{"$f":"IF(A4=\"\",\"\",③リレー情報確認!E10)","v":""},{"$f":"IF(A4=\"\",\"\",③リレー情報確認!D10)","v":""},{"$f":"IF(A4=\"\",\"\",種目情報!$J$4)","v":""},{"$f":"IF(A4=\"\",\"\",③リレー情報確認!$F$8)","v":""},{"$f":"IF(A4=\"\",\"\",IF(②選手情報入力!$R$6=\"\",0,1))","v":""},{"$f":"IF(A4=\"\",\"\",種目情報!$K$4)","v":""}]
[{"$f":"IF(③リレー情報確認!C11=\"\",\"\",410000+①団体情報入力!$D$4*10)","v":""},{"$f":"IF(A5=\"\",\"\",①団体情報入力!$D$4)","v":""},{"$f":"IF(A5=\"\",\"\",③リレー情報確認!$J$1)","v":""},{"$f":"IF(A5=\"\",\"\",③リレー情報確認!$P$1)","v":""},null,null,4,{"$f":"IF(A5=\"\",\"\",③リレー情報確認!E11)","v":""},{"$f":"IF(A5=\"\",\"\",③リレー情報確認!D11)","v":""},{"$f":"IF(A5=\"\",\"\",種目情報!$J$4)","v":""},{"$f":"IF(A5=\"\",\"\",③リレー情報確認!$F$8)","v":""},{"$f":"IF(A5=\"\",\"\",IF(②選手情報入力!$R$6=\"\",0,1))","v":""},{"$f":"IF(A5=\"\",\"\",種目情報!$K$4)","v":""}]
[{"$f":"IF(③リレー情報確認!C12=\"\",\"\",410000+①団体情報入力!$D$4*10)","v":""},{"$f":"IF(A6=\"\",\"\",①団体情報入力!$D$4)","v":""},{"$f":"IF(A6=\"\",\"\",③リレー情報確認!$J$1)","v":""},{"$f":"IF(A6=\"\",\"\",③リレー情報確認!$P$1)","v":""},null,null,5,{"$f":"IF(A6=\"\",\"\",③リレー情報確認!E12)","v":""},{"$f":"IF(A6=\"\",\"\",③リレー情報確認!D12)","v":""},{"$f":"IF(A6=\"\",\"\",種目情報!$J$4)","v":""},{"$f":"IF(A6=\"\",\"\",③リレー情報確認!$F$8)","v":""},{"$f":"IF(A6=\"\",\"\",IF(②選手情報入力!$R$6=\"\",0,1))","v":""},{"$f":"IF(A6=\"\",\"\",種目情報!$K$4)","v":""}]
{"$rows_left_out":20}
{"sheet":"Sheet6","index":10,"n_rows":409,"n_cols":6,"rows_kept":409,"cut":false,"hidden":false,"merged":[]}
["No","団体名略称","団体コード","団体名略称","団体名カナ","No"]
[1,"加藤建設",230431,"加藤建設","カブシキガイシャカトウケンセツ",1]
[2,"ﾄｰｴﾈｯｸ",230165,"ﾄｰｴﾈｯｸ","（カ）トーエネック",2]
[3,"愛教大ｸ名古屋",230090,"愛教大ｸ名古屋","アイキョウダイクラブナゴヤ",3]
[4,"愛三工業",230091,"愛三工業","アイサンコウギョウ",4]
[5,"AGUD",230366,"AGUD","アイチガクインダイガクシガクブ",5]
{"$rows_left_out":404}
{"sheet":"Sheet1","index":11,"n_rows":90,"n_cols":1,"rows_kept":90,"cut":false,"hidden":false,"merged":[]}
[{"$f":"RANDBETWEEN(700000000,888888889)","v":870404304}]
[{"$f":"RANDBETWEEN(700000000,888888889)","v":873369110}]
[762777123]
[867014286]
[871840435]
[883482877]
{"$rows_left_out":84}