{"text_format":"1","workbook":"xlsx","n_sheets":10,"sheets":["注意事項","①学校情報入力","②選手情報入力","③リレー情報確認","④種目別人数","⑤申込一覧表","　　　　　","種目情報","data_kyogisha","data_team"],"not_rendered":{"charts":0,"images":1,"macros":1,"external_links":2,"defined_names":8,"comments":2,"pivot_tables":0},"unopened":[],"bounds":{"document_bytes":16777216,"sheet_cells":100000,"rows_first":2000,"rows_last":500,"rows_between":2000,"halvings":0,"cell_chars":16384,"cell_head_chars":4096},"cells_cut":0,"cells_raw":0,"read":"whole","date_system":"1900"}

{"sheet":"注意事項","index":0,"n_rows":89,"n_cols":13,"rows_kept":89,"cut":false,"hidden":false,"merged":[[87,3,87,7],[0,0,0,13],[6,1,6,2],[6,3,6,7],[7,1,7,7],[4,2,4,7],[2,9,4,11],[8,1,8,2],[8,3,8,5],[2,2,2,7],[66,7,66,10],[3,2,3,4],[3,6,3,7]]}
["　★データ入力前にこのページの内容を必ずお読みください。"]
[]
[null,"大会名","第1回名古屋地区競技会",null,null,null,null,null,null,"高校用",null,null,"Ver.2"]
[null,"期　日","2017-04-01",null,null,"～","2017-04-02"]
[null,"会　場","パロマ瑞穂スタジアム・パロマ瑞穂北陸上競技場"]
[]
{"$rows_left_out":84}
{"sheet":"①学校情報入力","index":1,"n_rows":10,"n_cols":7,"rows_kept":10,"cut":false,"hidden":false,"merged":[[8,1,8,2],[9,1,9,8],[10,1,10,4],[10,5,10,8],[11,1,11,4],[11,5,11,8],[8,5,8,11],[7,3,7,5],[2,3,2,5],[4,1,4,2],[3,3,3,5],[5,3,5,5],[6,3,6,5],[5,1,5,2],[6,1,6,2],[7,1,7,2],[2,1,2,2],[3,1,3,2],[4,3,4,5]]}
["①団体情報入力"]
[]
[null,"団体コード",null,null,null,null,"←入力不要です"]
[null,"団体名",null,null,null,null,"←入力"]
[null,"略称団体名",null,null,null,null,"←入力(全角６文字以内です。大学は\"学\"を入れて６文字以内です。)"]
[null,"略称ヨミガナ",null,null,null,null,"←入力 半角カタカナで入力してください。"]
{"$rows_left_out":5}
{"sheet":"②選手情報入力","index":2,"n_rows":104,"n_cols":42,"rows_kept":104,"cut":false,"hidden":false,"merged":[[2,13,2,15]]}
["②選手情報入力"]
[]
[null,null,"※必要事項を全て入力してください。",null,null,null,null,null,null,null,null,null,null,"リレー記録"]
[null,null,"※リレー種目にエントリーをする場合は○を選択し、「③リレー情報確認」でメンバーを確認してください。",null,null,null,null,null,null,null,null,null,null,null,"4X100mR","4X400mR"]
[null,null,"※コピーしたデータを貼り付ける場合は、「形式を選択して貼り付け」から「値」で貼り付けてください。",null,null,null,null,null,null,null,null,null,null,"男子"]
[null,null,"※データを修正する場合は、必ず「Delete」キーを使用してください。",null,null,null,null,null,null,null,null,null,null,"女子"]
{"$rows_left_out":99}
{"sheet":"③リレー情報確認","index":3,"n_rows":14,"n_cols":24,"rows_kept":14,"cut":false,"hidden":false,"merged":[[0,9,0,11],[7,17,12,17],[7,5,12,5],[5,1,5,5],[7,23,12,23],[5,13,5,17],[5,19,5,23],[5,7,5,11],[7,11,12,11],[0,15,0,17]]}
["③リレー情報確認",null,null,null,null,null,null,null,"チーム名 ",{"$f":"IF(①学校情報入力!D5=\"\",\"\",①学校情報入力!D5)","v":""},null,null,null,null,"ｶﾅ",{"$f":"IF(①学校情報入力!F5=\"\",\"\",①学校情報入力!F5)","v":""}]
[]
[null,null,"※リレーにエントリーをする選手とチームの記録を確認してください。"]
[null,null,"※修正をする場合は「②選手情報入力」で修正してください。"]
[]
[null,"男4X100mR",null,null,null,null,null,"男4X400mR",null,null,null,null,null,"女4X100mR",null,null,null,null,null,"女4X400mR"]
{"$rows_left_out":9}
{"sheet":"④種目別人数","index":4,"n_rows":46,"n_cols":14,"rows_kept":46,"cut":false,"hidden":false,"merged":[[27,2,27,3],[45,2,45,4],[43,1,43,4],[44,2,44,4],[34,2,34,3],[32,2,32,3],[30,2,30,3],[31,2,31,3],[38,1,38,2],[39,2,39,3],[40,2,40,3],[36,2,36,3],[35,2,35,3],[33,2,33,3],[9,2,9,3],[10,2,10,3],[11,2,11,3],[45,5,45,6],[38,5,38,6],[12,2,12,3],[13,2,13,3],[14,2,14,3],[15,2,15,3],[16,2,16,3],[21,2,21,3],[22,2,22,3],[23,2,23,3],[24,2,24,3],[25,2,25,3],[26,2,26,3],[19,2,19,3],[20,2,20,3],[28,2,28,3],[29,2,29,3],[0,3,0,7],[1,0,1,7],[3,0,3,7],[6,1,6,2],[6,5,6,6],[2,0,2,4],[4,2,4,5],[5,3,5,6],[17,2,17,3],[18,2,18,3],[7,2,7,3],[8,2,8,3]]}
["④種目別人数一覧表",null,"Ver.2","このシートを印刷し裏面に振込明細のコピーを添付してください"]
["　　　帳票印刷ボタンをクリックして印刷を行ってください。↓　　"]
["第１回名古屋地区競技会",null,null,null,null,null,{"$f":"IF(①学校情報入力!D3=\"\",\"\",①学校情報入力!D3)","v":""}]
["種目別申込人数一覧表"]
[null,"申込責任者",{"$f":"IF(①学校情報入力!D8=\"\",\"\",①学校情報入力!D8)","v":""},null,null,null,"A4サイズ"]
[null,{"$f":"IF(①学校情報入力!D7=\"\",\"\",①学校情報入力!D7)","v":""},"学校名",{"$f":"IF(①学校情報入力!D5=\"\",\"\",①学校情報入力!D5)","v":""}]
{"$rows_left_out":41}
{"sheet":"⑤申込一覧表","index":5,"n_rows":97,"n_cols":13,"rows_kept":97,"cut":false,"hidden":false,"merged":[[3,1,4,1],[3,6,4,6],[3,3,3,4],[4,3,4,4],[1,4,1,7]]}
["⑤申込者一覧表"]
[null,null,null,"大会名",{"$f":"注意事項!C3&注意事項!F3","v":"第1回名古屋地区競技会"},null,null,null,"学校名",{"$f":"IF(①学校情報入力!D5=\"\",\"\",①学校情報入力!D5)","v":""},{"$f":"IF(①学校情報入力!D3=\"\",\"\",①学校情報入力!D3)","v":""}]
[]
[null,"人数","男　　子",{"$f":"②選手情報入力!G102","v":0},null,null,"リレー","男4X100mR",{"$f":"IF(③リレー情報確認!F8=\"\",\"\",③リレー情報確認!F8)","v":""},"男4X400mR",{"$f":"IF(③リレー情報確認!L8=\"\",\"\",③リレー情報確認!L8)","v":""}]
[null,null,"女　　子",{"$f":"②選手情報入力!G103","v":0},null,null,null,"女4X100mR",{"$f":"IF(③リレー情報確認!R8=\"\",\"\",③リレー情報確認!R8)","v":""},"女4X400mR",{"$f":"IF(③リレー情報確認!X8=\"\",\"\",③リレー情報確認!X8)","v":""}]
[]
{"$rows_left_out":92}
{"sheet":"　　　　　","index":6,"n_rows":0,"n_cols":0,"rows_kept":0,"cut":false,"hidden":false,"merged":[]}

{"sheet":"種目情報","index":7,"n_rows":52,"n_cols":15,"rows_kept":52,"cut":false,"hidden":false,"merged":[[31,12,51,12],[3,12,28,12],[1,13,1,14],[0,0,0,2],[0,4,0,6],[0,8,0,10],[1,0,2,0],[1,4,2,4],[1,8,2,8]]}
["男子",null,null,null,"女子",null,null,null,"リレー"]
["種目","種目","記録",null,"種目","種目","記録",null,"種目","種目","記録",null,null,"一覧表用　種目名"]
[null,"No","FLAG",null,null,"No","FLAG",null,null,"No","FLAG"]
["男100m",1,2,null,"女100m",28,2,null,"男子4X100mR",49,2,null,"男　　　子","男100m","男100m"]
["男200m",2,2,null,"女200m",29,2,null,"男子4X400mR",50,2,null,null,"男200m","男200m"]
["男400m",3,2,null,"女400m",30,2,null,"女子4X100mR",51,2,null,null,"男400m","男400m"]
{"$rows_left_out":47}
{"sheet":"data_kyogisha","index":8,"n_rows":91,"n_cols":34,"rows_kept":91,"cut":false,"hidden":false,"merged":[]}
["競技者NO","所属コード1","所属コード2","ナンバー","ナンバー2","競技者名","競技者名カナ","競技者名略称","性別","学年","生年","月日","個人所属地名","陸連コード","参加競技-競技コード1","参加競技-自己記録1","参加競技-オープン参加FLG1","参加競技-記録FLG1","参加競技-競技コード2","参加競技-自己記録2","参加競技-オープン参加FLG2","参加競技-記録FLG2","参加競技-競技コード3","参加競技-自己記録3","参加競技-オープン参加FLG3","参加競技-記録FLG3","参加競技-競技コード4","参加競技-自己記録4","参加競技-オープン参加FLG4","参加競技-記録FLG4","参加競技-競技コード5","参加競技-自己記録5","参加競技-オープン参加FLG5","参加競技-記録FLG5"]
[{"$f":"IF(E2=\"\",\"\",I2*1000000+①学校情報入力!$D$3*1000+②選手情報入力!A10)","v":""},{"$f":"IF(E2=\"\",\"\",①学校情報入力!$D$3)","v":""},null,{"$f":"IF(②選手情報入力!B10=\"\",\"\",②選手情報入力!B10)","v":""},{"$f":"IF(②選手情報入力!C10=\"\",\"\",②選手情報入力!C10)","v":""},{"$f":"IF(E2=\"\",\"\",②選手情報入力!D10)","v":""},{"$f":"IF(E2=\"\",\"\",②選手情報入力!E10)","v":""},{"$f":"IF(E2=\"\",\"\",F2)","v":""},{"$f":"IF(E2=\"\",\"\",IF(②選手情報入力!G10=\"男\",1,2))","v":""},{"$f":"IF(E2=\"\",\"\",IF(②選手情報入力!H10=\"\",\"\",②選手情報入力!H10))","v":""},null,{"$f":"IF(E2=\"\",\"\",0)","v":""},{"$f":"IF(E2=\"\",\"\",\"愛知\")","v":""},null,{"$f":"IF(E2=\"\",\"\",IF(②選手情報入力!I10=\"\",\"\",IF(I2=1,VLOOKUP(②選手情報入力!I10,種目情報!$A$4:$B$22,2,FALSE),VLOOKUP(②選手情報入力!I10,種目情報!$E$4:$F$22,2,FALSE))))","v":""},{"$f":"IF(E2=\"\",\"\",IF(②選手情報入力!J10=\"\",\"\",②選手情報入力!J10))","v":""},{"$f":"IF(E2=\"\",\"\",IF(②選手情報入力!I10=\"\",\"\",0))","v":""},{"$f":"IF(E2=\"\",\"\",IF(②選手情報入力!I10=\"\",\"\",IF(I2=1,VLOOKUP(②選手情報入力!I10,種目情報!$A$4:$C$22,3,FALSE),VLOOKUP(②選手情報入力!I10,種目情報!$E$4:$G$22,3,FALSE))))","v":""},{"$f":"IF(E2=\"\",\"\",IF(②選手情報入力!K10=\"\",\"\",IF(I2=1,VLOOKUP(②選手情報入力!K10,種目情報!$A$4:$B$22,2,FALSE),VLOOKUP(②選手情報入力!K10,種目情報!$E$4:$F$22,2,FALSE))))","v":""},{"$f":"IF(E2=\"\",\"\",IF(②選手情報入力!L10=\"\",\"\",②選手情報入力!L10))","v":""},{"$f":"IF(E2=\"\",\"\",IF(②選手情報入力!K10=\"\",\"\",0))","v":""},{"$f":"IF(E2=\"\",\"\",IF(②選手情報入力!K10=\"\",\"\",IF(I2=1,VLOOKUP(②選手情報入力!K10,種目情報!$A$4:$C$22,3,FALSE),VLOOKUP(②選手情報入力!K10,種目情報!$E$4:$G$22,3,FALSE))))","v":""},{"$f":"IF(E2=\"\",\"\",IF(②選手情報入力!M10=\"\",\"\",IF(I2=1,VLOOKUP(②選手情報入力!M10,種目情報!$A$4:$B$22,2,FALSE),VLOOKUP(②選手情報入力!M10,種目情報!$E$4:$F$22,2,FALSE))))","v":""},{"$f":"IF(E2=\"\",\"\",IF(②選手情報入力!N10=\"\",\"\",②選手情報入力!N10))","v":""},{"$f":"IF(E2=\"\",\"\",IF(②選手情報入力!M10=\"\",\"\",0))","v":""},{"$f":"IF(E2=\"\",\"\",IF(②選手情報入力!M10=\"\",\"\",IF(I2=1,VLOOKUP(②選手情報入力!M10,種目情報!$A$4:$C$22,3,FALSE),VLOOKUP(②選手情報入力!M10,種目情報!$E$4:$G$22,3,FALSE))))","v":""},{"$f":"IF(E2=\"\",\"\",IF(②選手情報入力!O10=\"\",\"\",IF(I2=1,種目情報!$J$4,種目情報!$J$6)))","v":""},{"$f":"IF(E2=\"\",\"\",IF(②選手情報入力!O10=\"\",\"\",IF(I2=1,IF(②選手情報入力!$O$5=\"\",\"\",②選手情報入力!$O$5),IF(②選手情報入力!$O$6=\"\",\"\",②選手情報入力!$O$6))))","v":""},{"$f":"IF(E2=\"\",\"\",IF(②選手情報入力!O10=\"\",\"\",0))","v":""},{"$f":"IF(E2=\"\",\"\",IF(②選手情報入力!O10=\"\",\"\",2))","v":""},{"$f":"IF(E2=\"\",\"\",IF(②選手情報入力!P10=\"\",\"\",IF(I2=1,種目情報!$J$5,種目情報!$J$7)))","v":""},{"$f":"IF(E2=\"\",\"\",IF(②選手情報入力!P10=\"\",\"\",IF(I2=1,IF(②選手情報入力!$P$5=\"\",\"\",②選手情報入力!$P$5),IF(②選手情報入力!$P$6=\"\",\"\",②選手情報入力!$P$6))))","v":""},{"$f":"IF(E2=\"\",\"\",IF(②選手情報入力!P10=\"\",\"\",0))","v":""},{"$f":"IF(E2=\"\",\"\",IF(②選手情報入力!P10=\"\",\"\",2))","v":""}]
[{"$f":"IF(E3=\"\",\"\",I3*1000000+①学校情報入力!$D$3*1000+②選手情報入力!A11)","v":""},{"$f":"IF(E3=\"\",\"\",①学校情報入力!$D$3)","v":""},null,{"$f":"IF(②選手情報入力!B11=\"\",\"\",②選手情報入力!B11)","v":""},{"$f":"IF(②選手情報入力!C11=\"\",\"\",②選手情報入力!C11)","v":""},{"$f":"IF(E3=\"\",\"\",②選手情報入力!D11)","v":""},{"$f":"IF(E3=\"\",\"\",②選手情報入力!E11)","v":""},{"$f":"IF(E3=\"\",\"\",F3)","v":""},{"$f":"IF(E3=\"\",\"\",IF(②選手情報入力!G11=\"男\",1,2))","v":""},{"$f":"IF(E3=\"\",\"\",IF(②選手情報入力!H11=\"\",\"\",②選手情報入力!H11))","v":""},null,{"$f":"IF(E3=\"\",\"\",0)","v":""},{"$f":"IF(E3=\"\",\"\",\"愛知\")","v":""},null,{"$f":"IF(E3=\"\",\"\",IF(②選手情報入力!I11=\"\",\"\",IF(I3=1,VLOOKUP(②選手情報入力!I11,種目情報!$A$4:$B$22,2,FALSE),VLOOKUP(②選手情報入力!I11,種目情報!$E$4:$F$22,2,FALSE))))","v":""},{"$f":"IF(E3=\"\",\"\",IF(②選手情報入力!J11=\"\",\"\",②選手情報入力!J11))","v":""},{"$f":"IF(E3=\"\",\"\",IF(②選手情報入力!I11=\"\",\"\",0))","v":""},{"$f":"IF(E3=\"\",\"\",IF(②選手情報入力!I11=\"\",\"\",IF(I3=1,VLOOKUP(②選手情報入力!I11,種目情報!$A$4:$C$22,3,FALSE),VLOOKUP(②選手情報入力!I11,種目情報!$E$4:$G$22,3,FALSE))))","v":""},{"$f":"IF(E3=\"\",\"\",IF(②選手情報入力!K11=\"\",\"\",IF(I3=1,VLOOKUP(②選手情報入力!K11,種目情報!$A$4:$B$22,2,FALSE),VLOOKUP(②選手情報入力!K11,種目情報!$E$4:$F$22,2,FALSE))))","v":""},{"$f":"IF(E3=\"\",\"\",IF(②選手情報入力!L11=\"\",\"\",②選手情報入力!L11))","v":""},{"$f":"IF(E3=\"\",\"\",IF(②選手情報入力!K11=\"\",\"\",0))","v":""},{"$f":"IF(E3=\"\",\"\",IF(②選手情報入力!K11=\"\",\"\",IF(I3=1,VLOOKUP(②選手情報入力!K11,種目情報!$A$4:$C$22,3,FALSE),VLOOKUP(②選手情報入力!K11,種目情報!$E$4:$G$22,3,FALSE))))","v":""},{"$f":"IF(E3=\"\",\"\",IF(②選手情報入力!M11=\"\",\"\",IF(I3=1,VLOOKUP(②選手情報入力!M11,種目情報!$A$4:$B$22,2,FALSE),VLOOKUP(②選手情報入力!M11,種目情報!$E$4:$F$22,2,FALSE))))","v":""},{"$f":"IF(E3=\"\",\"\",IF(②選手情報入力!N11=\"\",\"\",②選手情報入力!N11))","v":""},{"$f":"IF(E3=\"\",\"\",IF(②選手情報入力!M11=\"\",\"\",0))","v":""},{"$f":"IF(E3=\"\",\"\",IF(②選手情報入力!M11=\"\",\"\",IF(I3=1,VLOOKUP(②選手情報入力!M11,種目情報!$A$4:$C$22,3,FALSE),VLOOKUP(②選手情報入力!M11,種目情報!$E$4:$G$22,3,FALSE))))","v":""},{"$f":"IF(E3=\"\",\"\",IF(②選手情報入力!O11=\"\",\"\",IF(I3=1,種目情報!$J$4,種目情報!$J$6)))","v":""},{"$f":"IF(E3=\"\",\"\",IF(②選手情報入力!O11=\"\",\"\",IF(I3=1,IF(②選手情報入力!$O$5=\"\",\"\",②選手情報入力!$O$5),IF(②選手情報入力!$O$6=\"\",\"\",②選手情報入力!$O$6))))","v":""},{"$f":"IF(E3=\"\",\"\",IF(②選手情報入力!O11=\"\",\"\",0))","v":""},{"$f":"IF(E3=\"\",\"\",IF(②選手情報入力!O11=\"\",\"\",2))","v":""},{"$f":"IF(E3=\"\",\"\",IF(②選手情報入力!P11=\"\",\"\",IF(I3=1,種目情報!$J$5,種目情報!$J$7)))","v":""},{"$f":"IF(E3=\"\",\"\",IF(②選手情報入力!P11=\"\",\"\",IF(I3=1,IF(②選手情報入力!$P$5=\"\",\"\",②選手情報入力!$P$5),IF(②選手情報入力!$P$6=\"\",\"\",②選手情報入力!$P$6))))","v":""},{"$f":"IF(E3=\"\",\"\",IF(②選手情報入力!P11=\"\",\"\",0))","v":""},{"$f":"IF(E3=\"\",\"\",IF(②選手情報入力!P11=\"\",\"\",2))","v":""}]
[{"$f":"IF(E4=\"\",\"\",I4*1000000+①学校情報入力!$D$3*1000+②選手情報入力!A12)","v":""},{"$f":"IF(E4=\"\",\"\",①学校情報入力!$D$3)","v":""},null,{"$f":"IF(②選手情報入力!B12=\"\",\"\",②選手情報入力!B12)","v":""},{"$f":"IF(②選手情報入力!C12=\"\",\"\",②選手情報入力!C12)","v":""},{"$f":"IF(E4=\"\",\"\",②選手情報入力!D12)","v":""},{"$f":"IF(E4=\"\",\"\",②選手情報入力!E12)","v":""},"",{"$f":"IF(E4=\"\",\"\",IF(②選手情報入力!G12=\"男\",1,2))","v":""},{"$f":"IF(E4=\"\",\"\",IF(②選手情報入力!H12=\"\",\"\",②選手情報入力!H12))","v":""},null,"","",null,{"$f":"IF(E4=\"\",\"\",IF(②選手情報入力!I12=\"\",\"\",IF(I4=1,VLOOKUP(②選手情報入力!I12,種目情報!$A$4:$B$22,2,FALSE),VLOOKUP(②選手情報入力!I12,種目情報!$E$4:$F$22,2,FALSE))))","v":""},{"$f":"IF(E4=\"\",\"\",IF(②選手情報入力!J12=\"\",\"\",②選手情報入力!J12))","v":""},{"$f":"IF(E4=\"\",\"\",IF(②選手情報入力!I12=\"\",\"\",0))","v":""},{"$f":"IF(E4=\"\",\"\",IF(②選手情報入力!I12=\"\",\"\",IF(I4=1,VLOOKUP(②選手情報入力!I12,種目情報!$A$4:$C$22,3,FALSE),VLOOKUP(②選手情報入力!I12,種目情報!$E$4:$G$22,3,FALSE))))","v":""},{"$f":"IF(E4=\"\",\"\",IF(②選手情報入力!K12=\"\",\"\",IF(I4=1,VLOOKUP(②選手情報入力!K12,種目情報!$A$4:$B$22,2,FALSE),VLOOKUP(②選手情報入力!K12,種目情報!$E$4:$F$22,2,FALSE))))","v":""},{"$f":"IF(E4=\"\",\"\",IF(②選手情報入力!L12=\"\",\"\",②選手情報入力!L12))","v":""},{"$f":"IF(E4=\"\",\"\",IF(②選手情報入力!K12=\"\",\"\",0))","v":""},{"$f":"IF(E4=\"\",\"\",IF(②選手情報入力!K12=\"\",\"\",IF(I4=1,VLOOKUP(②選手情報入力!K12,種目情報!$A$4:$C$22,3,FALSE),VLOOKUP(②選手情報入力!K12,種目情報!$E$4:$G$22,3,FALSE))))","v":""},{"$f":"IF(E4=\"\",\"\",IF(②選手情報入力!M12=\"\",\"\",IF(I4=1,VLOOKUP(②選手情報入力!M12,種目情報!$A$4:$B$22,2,FALSE),VLOOKUP(②選手情報入力!M12,種目情報!$E$4:$F$22,2,FALSE))))","v":""},{"$f":"IF(E4=\"\",\"\",IF(②選手情報入力!N12=\"\",\"\",②選手情報入力!N12))","v":""},{"$f":"IF(E4=\"\",\"\",IF(②選手情報入力!M12=\"\",\"\",0))","v":""},{"$f":"IF(E4=\"\",\"\",IF(②選手情報入力!M12=\"\",\"\",IF(I4=1,VLOOKUP(②選手情報入力!M12,種目情報!$A$4:$C$22,3,FALSE),VLOOKUP(②選手情報入力!M12,種目情報!$E$4:$G$22,3,FALSE))))","v":""},{"$f":"IF(E4=\"\",\"\",IF(②選手情報入力!O12=\"\",\"\",IF(I4=1,種目情報!$J$4,種目情報!$J$6)))","v":""},{"$f":"IF(E4=\"\",\"\",IF(②選手情報入力!O12=\"\",\"\",IF(I4=1,IF(②選手情報入力!$O$5=\"\",\"\",②選手情報入力!$O$5),IF(②選手情報入力!$O$6=\"\",\"\",②選手情報入力!$O$6))))","v":""},{"$f":"IF(E4=\"\",\"\",IF(②選手情報入力!O12=\"\",\"\",0))","v":""},{"$f":"IF(E4=\"\",\"\",IF(②選手情報入力!O12=\"\",\"\",2))","v":""},{"$f":"IF(E4=\"\",\"\",IF(②選手情報入力!P12=\"\",\"\",IF(I4=1,種目情報!$J$5,種目情報!$J$7)))","v":""},{"$f":"IF(E4=\"\",\"\",IF(②選手情報入力!P12=\"\",\"\",IF(I4=1,IF(②選手情報入力!$P$5=\"\",\"\",②選手情報入力!$P$5),IF(②選手情報入力!$P$6=\"\",\"\",②選手情報入力!$P$6))))","v":""},{"$f":"IF(E4=\"\",\"\",IF(②選手情報入力!P12=\"\",\"\",0))","v":""},{"$f":"IF(E4=\"\",\"\",IF(②選手情報入力!P12=\"\",\"\",2))","v":""}]
[{"$f":"IF(E5=\"\",\"\",I5*1000000+①学校情報入力!$D$3*1000+②選手情報入力!A13)","v":""},{"$f":"IF(E5=\"\",\"\",①学校情報入力!$D$3)","v":""},null,{"$f":"IF(②選手情報入力!B13=\"\",\"\",②選手情報入力!B13)","v":""},{"$f":"IF(②選手情報入力!C13=\"\",\"\",②選手情報入力!C13)","v":""},{"$f":"IF(E5=\"\",\"\",②選手情報入力!D13)","v":""},{"$f":"IF(E5=\"\",\"\",②選手情報入力!E13)","v":""},"",{"$f":"IF(E5=\"\",\"\",IF(②選手情報入力!G13=\"男\",1,2))","v":""},{"$f":"IF(E5=\"\",\"\",IF(②選手情報入力!H13=\"\",\"\",②選手情報入力!H13))","v":""},null,"","",null,{"$f":"IF(E5=\"\",\"\",IF(②選手情報入力!I13=\"\",\"\",IF(I5=1,VLOOKUP(②選手情報入力!I13,種目情報!$A$4:$B$22,2,FALSE),VLOOKUP(②選手情報入力!I13,種目情報!$E$4:$F$22,2,FALSE))))","v":""},{"$f":"IF(E5=\"\",\"\",IF(②選手情報入力!J13=\"\",\"\",②選手情報入力!J13))","v":""},{"$f":"IF(E5=\"\",\"\",IF(②選手情報入力!I13=\"\",\"\",0))","v":""},{"$f":"IF(E5=\"\",\"\",IF(②選手情報入力!I13=\"\",\"\",IF(I5=1,VLOOKUP(②選手情報入力!I13,種目情報!$A$4:$C$22,3,FALSE),VLOOKUP(②選手情報入力!I13,種目情報!$E$4:$G$22,3,FALSE))))","v":""},{"$f":"IF(E5=\"\",\"\",IF(②選手情報入力!K13=\"\",\"\",IF(I5=1,VLOOKUP(②選手情報入力!K13,種目情報!$A$4:$B$22,2,FALSE),VLOOKUP(②選手情報入力!K13,種目情報!$E$4:$F$22,2,FALSE))))","v":""},{"$f":"IF(E5=\"\",\"\",IF(②選手情報入力!L13=\"\",\"\",②選手情報入力!L13))","v":""},{"$f":"IF(E5=\"\",\"\",IF(②選手情報入力!K13=\"\",\"\",0))","v":""},{"$f":"IF(E5=\"\",\"\",IF(②選手情報入力!K13=\"\",\"\",IF(I5=1,VLOOKUP(②選手情報入力!K13,種目情報!$A$4:$C$22,3,FALSE),VLOOKUP(②選手情報入力!K13,種目情報!$E$4:$G$22,3,FALSE))))","v":""},{"$f":"IF(E5=\"\",\"\",IF(②選手情報入力!M13=\"\",\"\",IF(I5=1,VLOOKUP(②選手情報入力!M13,種目情報!$A$4:$B$22,2,FALSE),VLOOKUP(②選手情報入力!M13,種目情報!$E$4:$F$22,2,FALSE))))","v":""},{"$f":"IF(E5=\"\",\"\",IF(②選手情報入力!N13=\"\",\"\",②選手情報入力!N13))","v":""},{"$f":"IF(E5=\"\",\"\",IF(②選手情報入力!M13=\"\",\"\",0))","v":""},{"$f":"IF(E5=\"\",\"\",IF(②選手情報入力!M13=\"\",\"\",IF(I5=1,VLOOKUP(②選手情報入力!M13,種目情報!$A$4:$C$22,3,FALSE),VLOOKUP(②選手情報入力!M13,種目情報!$E$4:$G$22,3,FALSE))))","v":""},{"$f":"IF(E5=\"\",\"\",IF(②選手情報入力!O13=\"\",\"\",IF(I5=1,種目情報!$J$4,種目情報!$J$6)))","v":""},{"$f":"IF(E5=\"\",\"\",IF(②選手情報入力!O13=\"\",\"\",IF(I5=1,IF(②選手情報入力!$O$5=\"\",\"\",②選手情報入力!$O$5),IF(②選手情報入力!$O$6=\"\",\"\",②選手情報入力!$O$6))))","v":""},{"$f":"IF(E5=\"\",\"\",IF(②選手情報入力!O13=\"\",\"\",0))","v":""},{"$f":"IF(E5=\"\",\"\",IF(②選手情報入力!O13=\"\",\"\",2))","v":""},{"$f":"IF(E5=\"\",\"\",IF(②選手情報入力!P13=\"\",\"\",IF(I5=1,種目情報!$J$5,種目情報!$J$7)))","v":""},{"$f":"IF(E5=\"\",\"\",IF(②選手情報入力!P13=\"\",\"\",IF(I5=1,IF(②選手情報入力!$P$5=\"\",\"\",②選手情報入力!$P$5),IF(②選手情報入力!$P$6=\"\",\"\",②選手情報入力!$P$6))))","v":""},{"$f":"IF(E5=\"\",\"\",IF(②選手情報入力!P13=\"\",\"\",0))","v":""},{"$f":"IF(E5=\"\",\"\",IF(②選手情報入力!P13=\"\",\"\",2))","v":""}]
[{"$f":"IF(E6=\"\",\"\",I6*1000000+①学校情報入力!$D$3*1000+②選手情報入力!A14)","v":""},{"$f":"IF(E6=\"\",\"\",①学校情報入力!$D$3)","v":""},null,{"$f":"IF(②選手情報入力!B14=\"\",\"\",②選手情報入力!B14)","v":""},{"$f":"IF(②選手情報入力!C14=\"\",\"\",②選手情報入力!C14)","v":""},{"$f":"IF(E6=\"\",\"\",②選手情報入力!D14)","v":""},{"$f":"IF(E6=\"\",\"\",②選手情報入力!E14)","v":""},"",{"$f":"IF(E6=\"\",\"\",IF(②選手情報入力!G14=\"男\",1,2))","v":""},{"$f":"IF(E6=\"\",\"\",IF(②選手情報入力!H14=\"\",\"\",②選手情報入力!H14))","v":""},null,"","",null,{"$f":"IF(E6=\"\",\"\",IF(②選手情報入力!I14=\"\",\"\",IF(I6=1,VLOOKUP(②選手情報入力!I14,種目情報!$A$4:$B$22,2,FALSE),VLOOKUP(②選手情報入力!I14,種目情報!$E$4:$F$22,2,FALSE))))","v":""},{"$f":"IF(E6=\"\",\"\",IF(②選手情報入力!J14=\"\",\"\",②選手情報入力!J14))","v":""},{"$f":"IF(E6=\"\",\"\",IF(②選手情報入力!I14=\"\",\"\",0))","v":""},{"$f":"IF(E6=\"\",\"\",IF(②選手情報入力!I14=\"\",\"\",IF(I6=1,VLOOKUP(②選手情報入力!I14,種目情報!$A$4:$C$22,3,FALSE),VLOOKUP(②選手情報入力!I14,種目情報!$E$4:$G$22,3,FALSE))))","v":""},{"$f":"IF(E6=\"\",\"\",IF(②選手情報入力!K14=\"\",\"\",IF(I6=1,VLOOKUP(②選手情報入力!K14,種目情報!$A$4:$B$22,2,FALSE),VLOOKUP(②選手情報入力!K14,種目情報!$E$4:$F$22,2,FALSE))))","v":""},{"$f":"IF(E6=\"\",\"\",IF(②選手情報入力!L14=\"\",\"\",②選手情報入力!L14))","v":""},{"$f":"IF(E6=\"\",\"\",IF(②選手情報入力!K14=\"\",\"\",0))","v":""},{"$f":"IF(E6=\"\",\"\",IF(②選手情報入力!K14=\"\",\"\",IF(I6=1,VLOOKUP(②選手情報入力!K14,種目情報!$A$4:$C$22,3,FALSE),VLOOKUP(②選手情報入力!K14,種目情報!$E$4:$G$22,3,FALSE))))","v":""},{"$f":"IF(E6=\"\",\"\",IF(②選手情報入力!M14=\"\",\"\",IF(I6=1,VLOOKUP(②選手情報入力!M14,種目情報!$A$4:$B$22,2,FALSE),VLOOKUP(②選手情報入力!M14,種目情報!$E$4:$F$22,2,FALSE))))","v":""},{"$f":"IF(E6=\"\",\"\",IF(②選手情報入力!N14=\"\",\"\",②選手情報入力!N14))","v":""},{"$f":"IF(E6=\"\",\"\",IF(②選手情報入力!M14=\"\",\"\",0))","v":""},{"$f":"IF(E6=\"\",\"\",IF(②選手情報入力!M14=\"\",\"\",IF(I6=1,VLOOKUP(②選手情報入力!M14,種目情報!$A$4:$C$22,3,FALSE),VLOOKUP(②選手情報入力!M14,種目情報!$E$4:$G$22,3,FALSE))))","v":""},{"$f":"IF(E6=\"\",\"\",IF(②選手情報入力!O14=\"\",\"\",IF(I6=1,種目情報!$J$4,種目情報!$J$6)))","v":""},{"$f":"IF(E6=\"\",\"\",IF(②選手情報入力!O14=\"\",\"\",IF(I6=1,IF(②選手情報入力!$O$5=\"\",\"\",②選手情報入力!$O$5),IF(②選手情報入力!$O$6=\"\",\"\",②選手情報入力!$O$6))))","v":""},{"$f":"IF(E6=\"\",\"\",IF(②選手情報入力!O14=\"\",\"\",0))","v":""},{"$f":"IF(E6=\"\",\"\",IF(②選手情報入力!O14=\"\",\"\",2))","v":""},{"$f":"IF(E6=\"\",\"\",IF(②選手情報入力!P14=\"\",\"\",IF(I6=1,種目情報!$J$5,種目情報!$J$7)))","v":""},{"$f":"IF(E6=\"\",\"\",IF(②選手情報入力!P14=\"\",\"\",IF(I6=1,IF(②選手情報入力!$P$5=\"\",\"\",②選手情報入力!$P$5),IF(②選手情報入力!$P$6=\"\",\"\",②選手情報入力!$P$6))))","v":""},{"$f":"IF(E6=\"\",\"\",IF(②選手情報入力!P14=\"\",\"\",0))","v":""},{"$f":"IF(E6=\"\",\"\",IF(②選手情報入力!P14=\"\",\"\",2))","v":""}]
{"$rows_left_out":86}
{"sheet":"data_team","index":9,"n_rows":25,"n_cols":13,"rows_kept":25,"cut":false,"hidden":false,"merged":[]}
["チームNO","所属コード","チーム名","チーム名カナ","チーム名略称","チーム正式名称","ID","競技者NO","競技者名","参加競技-競技コード","参加競技-自己記録","参加競技-オープン参加FLG","参加競技-記録FLG"]
[{"$f":"IF(③リレー情報確認!C8=\"\",\"\",410000+①学校情報入力!$D$3*10)","v":""},{"$f":"IF(A2=\"\",\"\",①学校情報入力!$D$3)","v":""},{"$f":"IF(A2=\"\",\"\",③リレー情報確認!$J$1)","v":""},{"$f":"IF(A2=\"\",\"\",③リレー情報確認!$P$1)","v":""},null,null,1,{"$f":"IF(A2=\"\",\"\",③リレー情報確認!E8)","v":""},{"$f":"IF(A2=\"\",\"\",③リレー情報確認!D8)","v":""},{"$f":"IF(A2=\"\",\"\",種目情報!$J$4)","v":""},{"$f":"IF(A2=\"\",\"\",③リレー情報確認!$F$8)","v":""},{"$f":"IF(A2=\"\",\"\",0)","v":""},{"$f":"IF(A2=\"\",\"\",種目情報!$K$4)","v":""}]
[{"$f":"IF(③リレー情報確認!C9=\"\",\"\",410000+①学校情報入力!$D$3*10)","v":""},{"$f":"IF(A3=\"\",\"\",①学校情報入力!$D$3)","v":""},{"$f":"IF(A3=\"\",\"\",③リレー情報確認!$J$1)","v":""},{"$f":"IF(A3=\"\",\"\",③リレー情報確認!$P$1)","v":""},null,null,2,{"$f":"IF(A3=\"\",\"\",③リレー情報確認!E9)","v":""},{"$f":"IF(A3=\"\",\"\",③リレー情報確認!D9)","v":""},{"$f":"IF(A3=\"\",\"\",種目情報!$J$4)","v":""},{"$f":"IF(A3=\"\",\"\",③リレー情報確認!$F$8)","v":""},{"$f":"IF(A3=\"\",\"\",0)","v":""},{"$f":"IF(A3=\"\",\"\",種目情報!$K$4)","v":""}]
[{"$f":"IF(③リレー情報確認!C10=\"\",\"\",410000+①学校情報入力!$D$3*10)","v":""},{"$f":"IF(A4=\"\",\"\",①学校情報入力!$D$3)","v":""},{"$f":"IF(A4=\"\",\"\",③リレー情報確認!$J$1)","v":""},{"$f":"IF(A4=\"\",\"\",③リレー情報確認!$P$1)","v":""},null,null,3,{"$f":"IF(A4=\"\",\"\",③リレー情報確認!E10)","v":""},{"$f":"IF(A4=\"\",\"\",③リレー情報確認!D10)","v":""},{"$f":"IF(A4=\"\",\"\",種目情報!$J$4)","v":""},{"$f":"IF(A4=\"\",\"\",③リレー情報確認!$F$8)","v":""},"",{"$f":"IF(A4=\"\",\"\",種目情報!$K$4)","v":""}]
[{"$f":"IF(③リレー情報確認!C11=\"\",\"\",410000+①学校情報入力!$D$3*10)","v":""},{"$f":"IF(A5=\"\",\"\",①学校情報入力!$D$3)","v":""},{"$f":"IF(A5=\"\",\"\",③リレー情報確認!$J$1)","v":""},{"$f":"IF(A5=\"\",\"\",③リレー情報確認!$P$1)","v":""},null,null,4,{"$f":"IF(A5=\"\",\"\",③リレー情報確認!E11)","v":""},{"$f":"IF(A5=\"\",\"\",③リレー情報確認!D11)","v":""},{"$f":"IF(A5=\"\",\"\",種目情報!$J$4)","v":""},{"$f":"IF(A5=\"\",\"\",③リレー情報確認!$F$8)","v":""},"",{"$f":"IF(A5=\"\",\"\",種目情報!$K$4)","v":""}]
[{"$f":"IF(③リレー情報確認!C12=\"\",\"\",410000+①学校情報入力!$D$3*10)","v":""},{"$f":"IF(A6=\"\",\"\",①学校情報入力!$D$3)","v":""},{"$f":"IF(A6=\"\",\"\",③リレー情報確認!$J$1)","v":""},{"$f":"IF(A6=\"\",\"\",③リレー情報確認!$P$1)","v":""},null,null,5,{"$f":"IF(A6=\"\",\"\",③リレー情報確認!E12)","v":""},{"$f":"IF(A6=\"\",\"\",③リレー情報確認!D12)","v":""},{"$f":"IF(A6=\"\",\"\",種目情報!$J$4)","v":""},{"$f":"IF(A6=\"\",\"\",③リレー情報確認!$F$8)","v":""},"",{"$f":"IF(A6=\"\",\"\",種目情報!$K$4)","v":""}]
{"$rows_left_out":19}