{"text_format":"1","workbook":"xlsx","n_sheets":12,"sheets":["注意事項","①団体情報入力","②選手情報入力","③リレー情報確認","④種目別人数","⑤申込一覧表","⑥個票","⑦リレー個票","　　　　　","種目情報","data_kyogisha","data_team"],"not_rendered":{"charts":0,"images":2,"macros":1,"external_links":2,"defined_names":13,"comments":0,"pivot_tables":0},"unopened":[],"bounds":{"document_bytes":16777216,"sheet_cells":100000,"rows_first":2000,"rows_last":500,"rows_between":2000,"halvings":0,"cell_chars":16384,"cell_head_chars":4096},"cells_cut":0,"cells_raw":0,"read":"whole","date_system":"1900"}

{"sheet":"注意事項","index":0,"n_rows":92,"n_cols":11,"rows_kept":92,"cut":false,"hidden":false,"merged":[[90,3,90,7],[6,1,6,2],[82,2,82,8],[83,2,83,8],[6,3,6,9],[3,2,3,7],[4,2,4,7],[2,9,4,11],[2,2,2,7],[69,7,69,10],[6,10,6,12]]}
[]
[]
[null,"大会名","2017愛知レディース陸上競技大会",null,null,null,null,null,null,"共通"]
[null,"期　日","平成２９年７月１日（土）、２日(日）"]
[null,"会　場","パロマ瑞穂スタジアム"]
[]
{"$rows_left_out":87}
{"sheet":"①団体情報入力","index":1,"n_rows":9,"n_cols":7,"rows_kept":9,"cut":false,"hidden":false,"merged":[[8,1,8,2],[7,3,7,5],[2,3,2,5],[4,1,4,2],[3,3,3,5],[5,3,5,5],[6,3,6,5],[5,1,5,2],[6,1,6,2],[7,1,7,2],[2,1,2,2],[3,1,3,2],[4,3,4,5]]}
["①団体情報入力"]
[]
[null,"団体コード",null,null,null,null,"←入力不要です"]
[null,"団体名",null,null,null,null,"←入力(正式名称ですが、国立大学法人などは省いてください)"]
[null,"略称団体名",null,null,null,null,"←入力(全角６文字以内です。大学は\"大\"を入れて６文字以内です。)"]
[null,"略称ヨミガナ",null,null,null,null,"←入力 略称に対する読みを半角カタカナで入力してください。"]
{"$rows_left_out":4}
{"sheet":"②選手情報入力","index":2,"n_rows":61,"n_cols":44,"rows_kept":61,"cut":false,"hidden":false,"merged":[[2,13,2,15]]}
["②選手情報入力",null,null,null,{"$f":"IF(①団体情報入力!D5=\"\",\"\",①団体情報入力!D5)","v":""}]
["※クラブチームのリレーは、同じ種別の方で編成してください。混合は認めません。"]
["※必要事項を全て入力してください。",null,null,null,null,null,null,null,null,null,null,null,null,"リレー記録"]
["※リレー種目にエントリーをする場合は○を選択し、「③リレー情報確認」でメンバーを確認してください。",null,null,null,null,null,null,null,null,null,null,null,null,null,"メドレーＲ","4X400mR"]
["※コピーしたデータを貼り付ける場合は、「形式を選択して貼り付け」から「値」で貼り付けてください。"]
["※データを修正する場合は、必ず「Delete」キーを使用してください。",null,null,null,null,null,null,null,null,null,null,null,null,"女子"]
{"$rows_left_out":56}
{"sheet":"③リレー情報確認","index":3,"n_rows":14,"n_cols":24,"rows_kept":14,"cut":false,"hidden":false,"merged":[[0,9,0,11],[7,17,12,17],[7,5,12,5],[5,1,5,5],[7,23,12,23],[5,13,5,17],[5,19,5,23],[5,7,5,11],[7,11,12,11],[0,15,0,17]]}
["③リレー情報確認",null,null,null,null,null,null,null,"チーム名 ",{"$f":"IF(①団体情報入力!D5=\"\",\"\",①団体情報入力!D5)","v":""},null,null,null,null,"ｶﾅ",{"$f":"IF(①団体情報入力!D6=\"\",\"\",①団体情報入力!D6)","v":""}]
[]
[null,null,"※リレーにエントリーをする選手とチームの記録を確認してください。"]
[null,null,"※修正をする場合は「②選手情報入力」で修正してください。"]
[]
[null,null,null,null,null,null,null,null,null,null,null,null,null,"メドレーR"]
{"$rows_left_out":9}
{"sheet":"④種目別人数","index":4,"n_rows":40,"n_cols":14,"rows_kept":40,"cut":false,"hidden":false,"merged":[[21,6,21,7],[22,6,22,7],[16,6,16,7],[17,6,17,7],[18,6,18,7],[19,6,19,7],[20,6,20,7],[11,6,11,7],[12,6,12,7],[13,6,13,7],[14,6,14,7],[15,6,15,7],[6,6,6,7],[7,6,7,7],[8,6,8,7],[9,6,9,7],[10,6,10,7],[8,2,8,3],[9,2,9,3],[10,2,10,3],[11,2,11,3],[26,2,26,3],[25,2,25,3],[24,2,24,3],[16,1,16,3],[19,2,19,3],[20,2,20,3],[21,2,21,3],[22,2,22,3],[18,2,18,3],[5,3,5,7],[25,5,25,6],[23,2,23,3],[1,0,1,7],[3,0,3,7],[2,0,2,4],[4,2,4,5],[2,6,2,7],[4,6,4,7],[6,2,6,3],[17,1,17,3],[12,2,12,3],[13,2,13,3],[14,2,14,3],[15,2,15,3],[7,2,7,3]]}
["④種目別人数一覧表",null,"※種目数・参加料等を確認してから印刷をしてください。"]
["　　　帳票印刷ボタンをクリックして印刷を行ってください。↓　　"]
[{"$f":"注意事項!C3","v":"2017愛知レディース陸上競技大会"},null,null,null,null,null,{"$f":"IF(①団体情報入力!D3=\"\",\"\",①団体情報入力!D3)","v":""}]
["種目別申込人数一覧表"]
[null,"申込責任者",{"$f":"IF(①団体情報入力!D8=\"\",\"\",①団体情報入力!D8)","v":""},null,null,null,"A4サイズ"]
[null,{"$f":"IF(①団体情報入力!D7=\"\",\"\",①団体情報入力!D7)","v":""},"団体名",{"$f":"IF(①団体情報入力!D5=\"\",\"\",①団体情報入力!D5)","v":""}]
{"$rows_left_out":35}
{"sheet":"⑤申込一覧表","index":5,"n_rows":55,"n_cols":13,"rows_kept":55,"cut":false,"hidden":false,"merged":[[3,1,4,1],[3,3,3,4],[4,3,4,4],[1,4,1,7]]}
["　⑤申込一覧表"]
[null,null,null,"大会名",{"$f":"注意事項!C3&注意事項!F3","v":"2017愛知レディース陸上競技大会"}]
[null,null,null,null,null,"団体名",{"$f":"IF(①団体情報入力!D5=\"\",\"\",①団体情報入力!D5)","v":""},{"$f":"IF(①団体情報入力!D3=\"\",\"\",①団体情報入力!D3)","v":""}]
[null,"人数","男　　子",{"$f":"②選手情報入力!G60","v":0}]
[null,null,"女　　子",{"$f":"②選手情報入力!G61","v":0},null,"メドレーＲ",{"$f":"IF(③リレー情報確認!R8=\"\",\"\",③リレー情報確認!R8)","v":""},null,null,null,{"$f":"IF(③リレー情報確認!X8=\"\",\"\",③リレー情報確認!X8)","v":""}]
[]
{"$rows_left_out":50}
{"sheet":"⑥個票","index":6,"n_rows":288,"n_cols":19,"rows_kept":288,"cut":false,"hidden":false,"merged":[[253,2,253,6],[253,12,253,16],[254,2,254,8],[254,12,254,18],[255,3,255,5],[255,13,255,15],[244,6,244,8],[244,13,244,15],[244,16,244,18],[246,2,247,3],[246,4,247,4],[246,5,247,5],[246,6,246,7],[246,8,247,8],[246,12,247,13],[246,14,247,14],[246,15,247,15],[246,16,246,17],[246,18,247,18],[247,16,247,17],[247,6,247,7],[244,3,244,5],[255,6,255,8],[255,16,255,18],[222,12,223,13],[223,16,223,17],[220,3,220,5],[241,2,241,6],[241,12,241,16],[242,2,242,8],[242,12,242,18],[234,14,235,14],[234,15,235,15],[234,16,234,17],[234,18,235,18],[235,6,235,7],[235,16,235,17],[234,2,235,3],[234,4,235,4],[234,5,235,5],[234,6,234,7],[234,8,235,8],[234,12,235,13],[230,12,230,18],[220,6,220,8],[220,13,220,15],[220,16,220,18],[222,2,223,3],[208,3,208,5],[208,6,208,8],[208,13,208,15],[208,16,208,18],[210,2,211,3],[210,4,211,4],[210,5,211,5],[210,6,210,7],[210,8,211,8],[210,12,211,13],[217,2,217,6],[217,12,217,16],[218,2,218,8],[218,12,218,18],[210,14,211,14],[210,15,211,15],[210,16,210,17],[210,18,211,18],[211,6,211,7],[211,16,211,17],[196,3,196,5],[196,6,196,8],[196,13,196,15],[196,16,196,18],[198,2,199,3],[198,4,199,4],[198,5,199,5],[198,6,198,7],[198,8,199,8],[198,12,199,13],[205,2,205,6],[205,12,205,16],[206,2,206,8],[206,12,206,18],[207,3,207,5],[207,13,207,15],[198,16,198,17],[198,18,199,18],[199,6,199,7],[199,16,199,17],[207,6,207,8],[207,16,207,18],[193,2,193,6],[193,12,193,16],[194,2,194,8],[194,12,194,18],[195,3,195,5],[195,13,195,15],[186,16,186,17],[186,18,187,18],[187,6,187,7],[187,16,187,17],[186,5,187,5],[186,6,186,7],[186,8,187,8],[186,12,187,13],[186,14,187,14],[186,15,187,15],[186,2,187,3],[186,4,187,4],[195,6,195,8],[195,16,195,18],[172,3,172,5],[172,6,172,8],[172,13,172,15],[172,16,172,18],[174,2,175,3],[174,4,175,4],[174,5,175,5],[174,8,175,8],[174,12,175,13],[174,14,175,14],[174,16,174,17],[174,18,175,18],[174,6,174,7],[183,3,183,5],[183,13,183,15],[184,3,184,5],[184,6,184,8],[184,13,184,15],[184,16,184,18],[175,16,175,17],[181,2,181,6],[181,12,181,16],[182,2,182,8],[182,12,182,18],[174,15,175,15],[175,6,175,7],[183,6,183,8],[183,16,183,18],[160,3,160,5],[160,6,160,8],[160,13,160,15],[160,16,160,18],[162,2,163,3],[162,4,163,4],[162,5,163,5],[162,6,162,7],[162,8,163,8],[162,12,163,13],[169,2,169,6],[169,12,169,16],[170,2,170,8],[170,12,170,18],[162,14,163,14],[162,15,163,15],[162,16,162,17],[162,18,163,18],[163,6,163,7],[163,16,163,17],[148,3,148,5],[148,6,148,8],[148,13,148,15],[148,16,148,18],[150,2,151,3],[150,4,151,4],[150,5,151,5],[150,6,150,7],[150,8,151,8],[150,12,151,13],[157,2,157,6],[157,12,157,16],[158,2,158,8],[158,12,158,18],[150,14,151,14],[150,15,151,15],[150,16,150,17],[150,18,151,18],[151,6,151,7],[151,16,151,17],[136,3,136,5],[136,6,136,8],[136,13,136,15],[136,16,136,18],[138,2,139,3],[138,4,139,4],[138,5,139,5],[138,6,138,7],[138,8,139,8],[138,12,139,13],[145,2,145,6],[145,12,145,16],[146,2,146,8],[146,12,146,18],[147,3,147,5],[147,13,147,15],[138,16,138,17],[138,18,139,18],[139,6,139,7],[139,16,139,17],[147,16,147,18],[147,6,147,8],[138,15,139,15],[133,2,133,6],[133,12,133,16],[134,2,134,8],[134,12,134,18],[135,3,135,5],[135,13,135,15],[126,16,126,17],[126,18,127,18],[127,6,127,7],[127,16,127,17],[126,5,127,5],[126,6,126,7],[126,8,127,8],[126,12,127,13],[126,14,127,14],[126,15,127,15],[135,16,135,18],[126,2,127,3],[126,4,127,4],[114,2,115,3],[114,4,115,4],[114,5,115,5],[114,8,115,8],[114,12,115,13],[114,14,115,14],[114,16,114,17],[114,18,115,18],[123,3,123,5],[123,13,123,15],[114,6,114,7],[114,15,115,15],[115,6,115,7],[123,6,123,8],[87,13,87,15],[76,13,76,15],[76,16,76,18],[78,12,79,13],[102,16,102,17],[102,18,103,18],[103,6,103,7],[103,16,103,17],[102,2,103,3],[102,4,103,4],[102,5,103,5],[102,6,102,7],[102,8,103,8],[102,12,103,13],[90,15,91,15],[90,16,90,17],[90,18,91,18],[85,2,85,6],[85,12,85,16],[86,2,86,8],[66,16,66,17],[78,16,78,17],[78,18,79,18],[79,16,79,17],[78,15,79,15],[79,6,79,7],[78,2,79,3],[78,4,79,4],[78,5,79,5],[78,6,78,7],[78,8,79,8],[66,18,67,18],[67,6,67,7],[67,16,67,17],[73,2,73,6],[73,12,73,16],[66,8,67,8],[66,12,67,13],[66,14,67,14],[66,15,67,15],[42,6,42,7],[42,8,43,8],[42,12,43,13],[54,18,55,18],[55,16,55,17],[54,4,55,4],[54,5,55,5],[54,6,54,7],[54,8,55,8],[54,12,55,13],[54,14,55,14],[54,15,55,15],[51,6,51,8],[51,16,51,18],[42,16,42,17],[42,18,43,18],[43,6,43,7],[43,16,43,17],[51,3,51,5],[51,13,51,15],[49,2,49,6],[49,12,49,16],[50,2,50,8],[50,12,50,18],[39,3,39,5],[39,13,39,15],[27,3,27,5],[27,6,27,8],[27,13,27,15],[27,16,27,18],[30,14,31,14],[30,15,31,15],[30,16,30,17],[30,18,31,18],[31,6,31,7],[31,16,31,17],[30,2,31,3],[30,4,31,4],[30,5,31,5],[30,6,30,7],[39,6,39,8],[39,16,39,18],[38,2,38,8],[37,2,37,6],[37,12,37,16],[38,12,38,18],[18,4,19,4],[18,5,19,5],[18,6,18,7],[18,8,19,8],[18,12,19,13],[15,6,15,8],[15,16,15,18],[28,13,28,15],[28,16,28,18],[25,2,25,6],[25,12,25,16],[26,2,26,8],[26,12,26,18],[16,13,16,15],[16,16,16,18],[28,3,28,5],[28,6,28,8],[42,2,43,3],[42,4,43,4],[42,5,43,5],[6,14,7,14],[6,15,7,15],[6,16,6,17],[6,18,7,18],[7,6,7,7],[7,16,7,17],[6,2,7,3],[6,4,7,4],[30,8,31,8],[30,12,31,13],[18,14,19,14],[18,15,19,15],[18,16,18,17],[18,18,19,18],[19,6,19,7],[19,16,19,17],[18,2,19,3],[15,3,15,5],[15,13,15,15],[16,3,16,5],[16,6,16,8],[62,2,62,8],[62,12,62,18],[52,6,52,8],[52,13,52,15],[52,16,52,18],[54,2,55,3],[54,16,54,17],[61,2,61,6],[61,12,61,16],[55,6,55,7],[52,3,52,5],[1,2,1,6],[1,12,1,16],[13,2,13,6],[13,12,13,16],[14,2,14,8],[14,12,14,18],[2,2,2,8],[2,12,2,18],[3,3,3,5],[3,13,3,15],[4,3,4,5],[4,6,4,8],[4,13,4,15],[4,16,4,18],[3,6,3,8],[3,16,3,18],[6,5,7,5],[6,6,6,7],[6,8,7,8],[6,12,7,13],[124,6,124,8],[124,13,124,15],[88,13,88,15],[86,12,86,18],[171,13,171,15],[159,13,159,15],[159,6,159,8],[135,6,135,8],[88,3,88,5],[100,16,100,18],[99,3,99,5],[100,3,100,5],[112,3,112,5],[112,6,112,8],[112,13,112,15],[112,16,112,18],[124,16,124,18],[115,16,115,17],[121,2,121,6],[121,12,121,16],[122,2,122,8],[122,12,122,18],[123,16,123,18],[87,3,87,5],[63,3,63,5],[63,13,63,15],[64,3,64,5],[64,6,64,8],[64,13,64,15],[78,14,79,14],[102,14,103,14],[102,15,103,15],[74,2,74,8],[75,3,75,5],[76,3,76,5],[76,6,76,8],[74,12,74,18],[75,13,75,15],[66,2,67,3],[66,4,67,4],[66,5,67,5],[66,6,66,7],[64,16,64,18],[88,16,88,18],[98,2,98,8],[88,6,88,8],[63,6,63,8],[63,16,63,18],[159,16,159,18],[171,6,171,8],[171,16,171,18],[91,6,91,7],[91,16,91,17],[90,2,91,3],[90,4,91,4],[90,5,91,5],[90,6,90,7],[90,8,91,8],[90,12,91,13],[109,2,109,6],[109,12,109,16],[110,2,110,8],[110,12,110,18],[159,3,159,5],[138,14,139,14],[111,13,111,15],[99,13,99,15],[100,6,100,8],[100,13,100,15],[171,3,171,5],[111,3,111,5],[124,3,124,5],[40,3,40,5],[40,6,40,8],[40,13,40,15],[40,16,40,18],[42,14,43,14],[42,15,43,15],[280,3,280,5],[280,6,280,8],[280,13,280,15],[280,16,280,18],[75,6,75,8],[75,16,75,18],[87,6,87,8],[87,16,87,18],[99,6,99,8],[99,16,99,18],[111,6,111,8],[111,16,111,18],[198,14,199,14],[198,15,199,15],[98,12,98,18],[97,2,97,6],[97,12,97,16],[90,14,91,14],[277,2,277,6],[277,12,277,16],[278,2,278,8],[278,12,278,18],[258,16,258,17],[258,18,259,18],[259,6,259,7],[259,16,259,17],[256,3,256,5],[256,6,256,8],[270,8,271,8],[270,12,271,13],[256,13,256,15],[256,16,256,18],[258,2,259,3],[258,4,259,4],[258,5,259,5],[258,6,258,7],[258,8,259,8],[258,12,259,13],[258,14,259,14],[258,15,259,15],[267,6,267,8],[267,16,267,18],[243,3,243,5],[243,13,243,15],[219,13,219,15],[219,3,219,5],[222,14,223,14],[222,15,223,15],[222,16,222,17],[222,18,223,18],[223,6,223,7],[219,16,219,18],[231,6,231,8],[231,16,231,18],[243,6,243,8],[243,16,243,18],[231,3,231,5],[231,13,231,15],[232,3,232,5],[232,6,232,8],[232,13,232,15],[232,16,232,18],[229,2,229,6],[229,12,229,16],[219,6,219,8],[230,2,230,8],[267,3,267,5],[267,13,267,15],[270,14,271,14],[270,15,271,15],[270,16,270,17],[270,18,271,18],[271,6,271,7],[271,16,271,17],[268,3,268,5],[268,6,268,8],[268,13,268,15],[268,16,268,18],[270,2,271,3],[270,4,271,4],[270,5,271,5],[270,6,270,7],[222,4,223,4],[222,5,223,5],[222,6,222,7],[222,8,223,8],[282,18,283,18],[283,6,283,7],[283,16,283,17],[282,2,283,3],[282,4,283,4],[282,5,283,5],[282,6,282,7],[282,8,283,8],[282,12,283,13],[282,14,283,14],[282,15,283,15],[282,16,282,17],[279,3,279,5],[279,6,279,8],[279,13,279,15],[279,16,279,18],[265,2,265,6],[265,12,265,16],[266,2,266,8],[266,12,266,18]]}
[]
[null,"１","2017レディース陸上個人申込票",null,null,null,null,null,"資格審査用",null,null,"２","2017レディース陸上個人申込票",null,null,null,null,null,"資格審査用"]
[null,"種別種目",{"$f":"IF(②選手情報入力!I10=\"\",\"\",②選手情報入力!I10)","v":""},null,null,null,null,null,null,null,null,"種別種目",{"$f":"IF(②選手情報入力!$I$11=\"\",\"\",②選手情報入力!$I$11)","v":""}]
[null,"ナンバー","ﾌ ﾘ ｶﾞﾅ",{"$f":"IF(②選手情報入力!$E$10=\"\",\"\",②選手情報入力!$E$10)","v":""},null,null,"団体名",null,null,null,null,"ナンバー","ﾌ ﾘ ｶﾞﾅ",{"$f":"IF(②選手情報入力!$E$11=\"\",\"\",②選手情報入力!$E$11)","v":""},null,null,"団体名"]
[null,{"$f":"IF(②選手情報入力!$C$10=\"\",\"\",②選手情報入力!$C$10)","v":""},"氏  名",{"$f":"IF(②選手情報入力!$D$10=\"\",\"\",②選手情報入力!$D$10)","v":""},null,null,{"$f":"IF(①団体情報入力!$D$5=\"\",\"\",①団体情報入力!$D$5)","v":""},null,null,null,null,{"$f":"IF(②選手情報入力!$C$11=\"\",\"\",②選手情報入力!$C$11)","v":""},"氏  名",{"$f":"IF(②選手情報入力!$D$11=\"\",\"\",②選手情報入力!$D$11)","v":""},null,null,{"$f":"IF(①団体情報入力!$D$5=\"\",\"\",①団体情報入力!$D$5)","v":""}]
[null,null,"大　会　名",null,"年月日(yy/mm/dd)","順位","記　録",null,"場  所",null,null,null,"大　会　名",null,"年月日(yy/mm/dd)","順位","記　録",null,"場  所"]
{"$rows_left_out":283}
{"sheet":"⑦リレー個票","index":7,"n_rows":17,"n_cols":6,"rows_kept":17,"cut":false,"hidden":false,"merged":[[16,2,16,4],[16,5,16,6],[13,2,13,4],[13,5,13,6],[14,2,14,4],[14,5,14,6],[7,1,9,6],[4,5,4,6],[3,1,3,6],[15,2,15,4],[15,5,15,6],[11,2,11,4],[11,5,11,6],[12,2,12,4],[12,5,12,6],[4,2,6,4],[5,5,6,6]]}
[]
[]
[]
[null,"2017愛知レディース陸上    リレー申込票"]
[null,null,"メドレーＲ",null,null,"記 　録"]
[null,"種  目",null,null,null,{"$f":"IF(③リレー情報確認!R14=0,\"\",③リレー情報確認!R8)","v":""}]
{"$rows_left_out":12}
{"sheet":"　　　　　","index":8,"n_rows":0,"n_cols":0,"rows_kept":0,"cut":false,"hidden":false,"merged":[]}

{"sheet":"種目情報","index":9,"n_rows":55,"n_cols":15,"rows_kept":55,"cut":false,"hidden":false,"merged":[[3,12,28,12],[30,12,50,12],[1,13,1,14],[0,0,0,2],[0,4,0,6],[0,8,0,10],[1,0,2,0],[1,4,2,4],[1,8,2,8]]}
["男子",null,null,null,"女子",null,null,null,"リレー"]
["種目","種目","記録",null,"種目","種目","記録",null,"種目","種目","記録",null,null,"一覧表用　種目名"]
[null,"No","FLAG",null,null,"No","FLAG",null,null,"No","FLAG"]
[null,null,null,null,"100m",10,2,null,null,null,2,null,"男　　　子","100m","100m"]
[null,null,null,null,"200m",11,2,null,null,null,2,null,null,"200m","200m"]
[null,null,null,null,"400m",12,2,null,"共通メドレーＲ",25,2,null,null,"400m","400m"]
{"$rows_left_out":50}
{"sheet":"data_kyogisha","index":10,"n_rows":49,"n_cols":34,"rows_kept":49,"cut":false,"hidden":false,"merged":[]}
["競技者NO","所属コード1","所属コード2","ナンバー","ナンバー2","競技者名","競技者名カナ","競技者名略称","性別","学年","生年","月日","個人所属地名","陸連コード","参加競技-競技コード1","参加競技-自己記録1","参加競技-オープン参加FLG1","参加競技-記録FLG1","参加競技-競技コード2","参加競技-自己記録2","参加競技-オープン参加FLG2","参加競技-記録FLG2","参加競技-競技コード3","参加競技-自己記録3","参加競技-オープン参加FLG3","参加競技-記録FLG3","参加競技-競技コード4","参加競技-自己記録4","参加競技-オープン参加FLG4","参加競技-記録FLG4","参加競技-競技コード5","参加競技-自己記録5","参加競技-オープン参加FLG5","参加競技-記録FLG5"]
[{"$f":"IF(E2=\"\",\"\",I2*1000000+①団体情報入力!$D$3*1000+②選手情報入力!A10)","v":""},{"$f":"IF(E2=\"\",\"\",①団体情報入力!$D$3)","v":""},null,{"$f":"IF(②選手情報入力!B10=\"\",\"\",②選手情報入力!B10)","v":""},{"$f":"IF(②選手情報入力!C10=\"\",\"\",②選手情報入力!C10)","v":""},{"$f":"IF(E2=\"\",\"\",②選手情報入力!D10)","v":""},{"$f":"IF(E2=\"\",\"\",②選手情報入力!E10)","v":""},{"$f":"IF(E2=\"\",\"\",F2)","v":""},{"$f":"IF(E2=\"\",\"\",IF(②選手情報入力!G10=\"男\",1,2))","v":""},{"$f":"IF(E2=\"\",\"\",IF(②選手情報入力!H10=\"\",\"\",②選手情報入力!H10))","v":""},null,{"$f":"IF(E2=\"\",\"\",0)","v":""},{"$f":"IF(E2=\"\",\"\",\"愛知\")","v":""},null,{"$f":"IF(E2=\"\",\"\",IF(②選手情報入力!I10=\"\",\"\",IF(I2=1,VLOOKUP(②選手情報入力!I10,種目情報!$A$4:$B$221,2,FALSE),VLOOKUP(②選手情報入力!I10,種目情報!$E$4:$F$221,2,FALSE))))","v":""},{"$f":"IF(E2=\"\",\"\",IF(②選手情報入力!J10=\"\",\"\",②選手情報入力!J10))","v":""},{"$f":"IF(E2=\"\",\"\",IF(②選手情報入力!I10=\"\",\"\",0))","v":""},{"$f":"IF(E2=\"\",\"\",IF(②選手情報入力!I10=\"\",\"\",IF(I2=1,VLOOKUP(②選手情報入力!I10,種目情報!$A$4:$C$21,3,FALSE),VLOOKUP(②選手情報入力!I10,種目情報!$E$4:$G$251,3,FALSE))))","v":""},null,null,null,null,null,null,null,null,{"$f":"IF(E2=\"\",\"\",IF(②選手情報入力!O10=\"\",\"\",IF(I2=1,種目情報!$J$4,種目情報!$J$6)))","v":""},{"$f":"IF(E2=\"\",\"\",IF(②選手情報入力!O10=\"\",\"\",IF(I2=1,IF(②選手情報入力!$O$5=\"\",\"\",②選手情報入力!$O$5),IF(②選手情報入力!$O$6=\"\",\"\",②選手情報入力!$O$6))))","v":""},{"$f":"IF(E2=\"\",\"\",IF(②選手情報入力!O10=\"\",\"\",0))","v":""},{"$f":"IF(E2=\"\",\"\",IF(②選手情報入力!O10=\"\",\"\",2))","v":""}]
[{"$f":"IF(E3=\"\",\"\",I3*1000000+①団体情報入力!$D$3*1000+②選手情報入力!A11)","v":""},{"$f":"IF(E3=\"\",\"\",①団体情報入力!$D$3)","v":""},null,{"$f":"IF(②選手情報入力!B11=\"\",\"\",②選手情報入力!B11)","v":""},{"$f":"IF(②選手情報入力!C11=\"\",\"\",②選手情報入力!C11)","v":""},{"$f":"IF(E3=\"\",\"\",②選手情報入力!D11)","v":""},{"$f":"IF(E3=\"\",\"\",②選手情報入力!E11)","v":""},{"$f":"IF(E3=\"\",\"\",F3)","v":""},{"$f":"IF(E3=\"\",\"\",IF(②選手情報入力!G11=\"男\",1,2))","v":""},{"$f":"IF(E3=\"\",\"\",IF(②選手情報入力!H11=\"\",\"\",②選手情報入力!H11))","v":""},null,{"$f":"IF(E3=\"\",\"\",0)","v":""},{"$f":"IF(E3=\"\",\"\",\"愛知\")","v":""},null,{"$f":"IF(E3=\"\",\"\",IF(②選手情報入力!I11=\"\",\"\",IF(I3=1,VLOOKUP(②選手情報入力!I11,種目情報!$A$4:$B$221,2,FALSE),VLOOKUP(②選手情報入力!I11,種目情報!$E$4:$F$221,2,FALSE))))","v":""},{"$f":"IF(E3=\"\",\"\",IF(②選手情報入力!J11=\"\",\"\",②選手情報入力!J11))","v":""},{"$f":"IF(E3=\"\",\"\",IF(②選手情報入力!I11=\"\",\"\",0))","v":""},{"$f":"IF(E3=\"\",\"\",IF(②選手情報入力!I11=\"\",\"\",IF(I3=1,VLOOKUP(②選手情報入力!I11,種目情報!$A$4:$C$21,3,FALSE),VLOOKUP(②選手情報入力!I11,種目情報!$E$4:$G$251,3,FALSE))))","v":""},null,null,null,null,null,null,null,null,{"$f":"IF(E3=\"\",\"\",IF(②選手情報入力!O11=\"\",\"\",IF(I3=1,種目情報!$J$4,種目情報!$J$6)))","v":""},{"$f":"IF(E3=\"\",\"\",IF(②選手情報入力!O11=\"\",\"\",IF(I3=1,IF(②選手情報入力!$O$5=\"\",\"\",②選手情報入力!$O$5),IF(②選手情報入力!$O$6=\"\",\"\",②選手情報入力!$O$6))))","v":""},{"$f":"IF(E3=\"\",\"\",IF(②選手情報入力!O11=\"\",\"\",0))","v":""},{"$f":"IF(E3=\"\",\"\",IF(②選手情報入力!O11=\"\",\"\",2))","v":""}]
[{"$f":"IF(E4=\"\",\"\",I4*1000000+①団体情報入力!$D$3*1000+②選手情報入力!A12)","v":""},{"$f":"IF(E4=\"\",\"\",①団体情報入力!$D$3)","v":""},null,{"$f":"IF(②選手情報入力!B12=\"\",\"\",②選手情報入力!B12)","v":""},{"$f":"IF(②選手情報入力!C12=\"\",\"\",②選手情報入力!C12)","v":""},{"$f":"IF(E4=\"\",\"\",②選手情報入力!D12)","v":""},{"$f":"IF(E4=\"\",\"\",②選手情報入力!E12)","v":""},"",{"$f":"IF(E4=\"\",\"\",IF(②選手情報入力!G12=\"男\",1,2))","v":""},{"$f":"IF(E4=\"\",\"\",IF(②選手情報入力!H12=\"\",\"\",②選手情報入力!H12))","v":""},null,"","",null,{"$f":"IF(E4=\"\",\"\",IF(②選手情報入力!I12=\"\",\"\",IF(I4=1,VLOOKUP(②選手情報入力!I12,種目情報!$A$4:$B$221,2,FALSE),VLOOKUP(②選手情報入力!I12,種目情報!$E$4:$F$221,2,FALSE))))","v":""},{"$f":"IF(E4=\"\",\"\",IF(②選手情報入力!J12=\"\",\"\",②選手情報入力!J12))","v":""},{"$f":"IF(E4=\"\",\"\",IF(②選手情報入力!I12=\"\",\"\",0))","v":""},{"$f":"IF(E4=\"\",\"\",IF(②選手情報入力!I12=\"\",\"\",IF(I4=1,VLOOKUP(②選手情報入力!I12,種目情報!$A$4:$C$21,3,FALSE),VLOOKUP(②選手情報入力!I12,種目情報!$E$4:$G$251,3,FALSE))))","v":""},null,null,null,null,null,null,null,null,{"$f":"IF(E4=\"\",\"\",IF(②選手情報入力!O12=\"\",\"\",IF(I4=1,種目情報!$J$4,種目情報!$J$6)))","v":""},{"$f":"IF(E4=\"\",\"\",IF(②選手情報入力!O12=\"\",\"\",IF(I4=1,IF(②選手情報入力!$O$5=\"\",\"\",②選手情報入力!$O$5),IF(②選手情報入力!$O$6=\"\",\"\",②選手情報入力!$O$6))))","v":""},{"$f":"IF(E4=\"\",\"\",IF(②選手情報入力!O12=\"\",\"\",0))","v":""},{"$f":"IF(E4=\"\",\"\",IF(②選手情報入力!O12=\"\",\"\",2))","v":""}]
[{"$f":"IF(E5=\"\",\"\",I5*1000000+①団体情報入力!$D$3*1000+②選手情報入力!A13)","v":""},{"$f":"IF(E5=\"\",\"\",①団体情報入力!$D$3)","v":""},null,{"$f":"IF(②選手情報入力!B13=\"\",\"\",②選手情報入力!B13)","v":""},{"$f":"IF(②選手情報入力!C13=\"\",\"\",②選手情報入力!C13)","v":""},{"$f":"IF(E5=\"\",\"\",②選手情報入力!D13)","v":""},{"$f":"IF(E5=\"\",\"\",②選手情報入力!E13)","v":""},"",{"$f":"IF(E5=\"\",\"\",IF(②選手情報入力!G13=\"男\",1,2))","v":""},{"$f":"IF(E5=\"\",\"\",IF(②選手情報入力!H13=\"\",\"\",②選手情報入力!H13))","v":""},null,"","",null,{"$f":"IF(E5=\"\",\"\",IF(②選手情報入力!I13=\"\",\"\",IF(I5=1,VLOOKUP(②選手情報入力!I13,種目情報!$A$4:$B$221,2,FALSE),VLOOKUP(②選手情報入力!I13,種目情報!$E$4:$F$221,2,FALSE))))","v":""},{"$f":"IF(E5=\"\",\"\",IF(②選手情報入力!J13=\"\",\"\",②選手情報入力!J13))","v":""},{"$f":"IF(E5=\"\",\"\",IF(②選手情報入力!I13=\"\",\"\",0))","v":""},{"$f":"IF(E5=\"\",\"\",IF(②選手情報入力!I13=\"\",\"\",IF(I5=1,VLOOKUP(②選手情報入力!I13,種目情報!$A$4:$C$21,3,FALSE),VLOOKUP(②選手情報入力!I13,種目情報!$E$4:$G$251,3,FALSE))))","v":""},null,null,null,null,null,null,null,null,{"$f":"IF(E5=\"\",\"\",IF(②選手情報入力!O13=\"\",\"\",IF(I5=1,種目情報!$J$4,種目情報!$J$6)))","v":""},{"$f":"IF(E5=\"\",\"\",IF(②選手情報入力!O13=\"\",\"\",IF(I5=1,IF(②選手情報入力!$O$5=\"\",\"\",②選手情報入力!$O$5),IF(②選手情報入力!$O$6=\"\",\"\",②選手情報入力!$O$6))))","v":""},{"$f":"IF(E5=\"\",\"\",IF(②選手情報入力!O13=\"\",\"\",0))","v":""},{"$f":"IF(E5=\"\",\"\",IF(②選手情報入力!O13=\"\",\"\",2))","v":""}]
[{"$f":"IF(E6=\"\",\"\",I6*1000000+①団体情報入力!$D$3*1000+②選手情報入力!A14)","v":""},{"$f":"IF(E6=\"\",\"\",①団体情報入力!$D$3)","v":""},null,{"$f":"IF(②選手情報入力!B14=\"\",\"\",②選手情報入力!B14)","v":""},{"$f":"IF(②選手情報入力!C14=\"\",\"\",②選手情報入力!C14)","v":""},{"$f":"IF(E6=\"\",\"\",②選手情報入力!D14)","v":""},{"$f":"IF(E6=\"\",\"\",②選手情報入力!E14)","v":""},"",{"$f":"IF(E6=\"\",\"\",IF(②選手情報入力!G14=\"男\",1,2))","v":""},{"$f":"IF(E6=\"\",\"\",IF(②選手情報入力!H14=\"\",\"\",②選手情報入力!H14))","v":""},null,"","",null,{"$f":"IF(E6=\"\",\"\",IF(②選手情報入力!I14=\"\",\"\",IF(I6=1,VLOOKUP(②選手情報入力!I14,種目情報!$A$4:$B$221,2,FALSE),VLOOKUP(②選手情報入力!I14,種目情報!$E$4:$F$221,2,FALSE))))","v":""},{"$f":"IF(E6=\"\",\"\",IF(②選手情報入力!J14=\"\",\"\",②選手情報入力!J14))","v":""},{"$f":"IF(E6=\"\",\"\",IF(②選手情報入力!I14=\"\",\"\",0))","v":""},{"$f":"IF(E6=\"\",\"\",IF(②選手情報入力!I14=\"\",\"\",IF(I6=1,VLOOKUP(②選手情報入力!I14,種目情報!$A$4:$C$21,3,FALSE),VLOOKUP(②選手情報入力!I14,種目情報!$E$4:$G$251,3,FALSE))))","v":""},null,null,null,null,null,null,null,null,{"$f":"IF(E6=\"\",\"\",IF(②選手情報入力!O14=\"\",\"\",IF(I6=1,種目情報!$J$4,種目情報!$J$6)))","v":""},{"$f":"IF(E6=\"\",\"\",IF(②選手情報入力!O14=\"\",\"\",IF(I6=1,IF(②選手情報入力!$O$5=\"\",\"\",②選手情報入力!$O$5),IF(②選手情報入力!$O$6=\"\",\"\",②選手情報入力!$O$6))))","v":""},{"$f":"IF(E6=\"\",\"\",IF(②選手情報入力!O14=\"\",\"\",0))","v":""},{"$f":"IF(E6=\"\",\"\",IF(②選手情報入力!O14=\"\",\"\",2))","v":""}]
{"$rows_left_out":44}
{"sheet":"data_team","index":11,"n_rows":7,"n_cols":13,"rows_kept":7,"cut":false,"hidden":false,"merged":[]}
["チームNO","所属コード","チーム名","チーム名カナ","チーム名略称","チーム正式名称","ID","競技者NO","競技者名","参加競技-競技コード","参加競技-自己記録","参加競技-オープン参加FLG","参加競技-記録FLG"]
[{"$f":"IF(③リレー情報確認!O8=\"\",\"\",920000+①団体情報入力!$D$3*10)","v":""},{"$f":"IF(A2=\"\",\"\",①団体情報入力!$D$3)","v":""},{"$f":"IF(A2=\"\",\"\",③リレー情報確認!$J$1)","v":""},{"$f":"IF(A2=\"\",\"\",③リレー情報確認!$P$1)","v":""},null,null,1,{"$f":"IF(A2=\"\",\"\",③リレー情報確認!Q8)","v":""},{"$f":"IF(A2=\"\",\"\",③リレー情報確認!P8)","v":""},{"$f":"IF(A2=\"\",\"\",種目情報!$J$6)","v":""},{"$f":"IF(A2=\"\",\"\",③リレー情報確認!$R$8)","v":""},{"$f":"IF(A2=\"\",\"\",0)","v":""},{"$f":"IF(A2=\"\",\"\",種目情報!$K$6)","v":""}]
[{"$f":"IF(③リレー情報確認!O9=\"\",\"\",920000+①団体情報入力!$D$3*10)","v":""},{"$f":"IF(A3=\"\",\"\",①団体情報入力!$D$3)","v":""},{"$f":"IF(A3=\"\",\"\",③リレー情報確認!$J$1)","v":""},{"$f":"IF(A3=\"\",\"\",③リレー情報確認!$P$1)","v":""},null,null,2,{"$f":"IF(A3=\"\",\"\",③リレー情報確認!Q9)","v":""},{"$f":"IF(A3=\"\",\"\",③リレー情報確認!P9)","v":""},{"$f":"IF(A3=\"\",\"\",種目情報!$J$6)","v":""},{"$f":"IF(A3=\"\",\"\",③リレー情報確認!$R$8)","v":""},{"$f":"IF(A3=\"\",\"\",0)","v":""},{"$f":"IF(A3=\"\",\"\",種目情報!$K$6)","v":""}]
[{"$f":"IF(③リレー情報確認!O10=\"\",\"\",920000+①団体情報入力!$D$3*10)","v":""},{"$f":"IF(A4=\"\",\"\",①団体情報入力!$D$3)","v":""},{"$f":"IF(A4=\"\",\"\",③リレー情報確認!$J$1)","v":""},{"$f":"IF(A4=\"\",\"\",③リレー情報確認!$P$1)","v":""},null,null,3,{"$f":"IF(A4=\"\",\"\",③リレー情報確認!Q10)","v":""},{"$f":"IF(A4=\"\",\"\",③リレー情報確認!P10)","v":""},{"$f":"IF(A4=\"\",\"\",種目情報!$J$6)","v":""},{"$f":"IF(A4=\"\",\"\",③リレー情報確認!$R$8)","v":""},"",{"$f":"IF(A4=\"\",\"\",種目情報!$K$6)","v":""}]
[{"$f":"IF(③リレー情報確認!O11=\"\",\"\",920000+①団体情報入力!$D$3*10)","v":""},{"$f":"IF(A5=\"\",\"\",①団体情報入力!$D$3)","v":""},{"$f":"IF(A5=\"\",\"\",③リレー情報確認!$J$1)","v":""},{"$f":"IF(A5=\"\",\"\",③リレー情報確認!$P$1)","v":""},null,null,4,{"$f":"IF(A5=\"\",\"\",③リレー情報確認!Q11)","v":""},{"$f":"IF(A5=\"\",\"\",③リレー情報確認!P11)","v":""},{"$f":"IF(A5=\"\",\"\",種目情報!$J$6)","v":""},{"$f":"IF(A5=\"\",\"\",③リレー情報確認!$R$8)","v":""},"",{"$f":"IF(A5=\"\",\"\",種目情報!$K$6)","v":""}]
[{"$f":"IF(③リレー情報確認!O12=\"\",\"\",920000+①団体情報入力!$D$3*10)","v":""},{"$f":"IF(A6=\"\",\"\",①団体情報入力!$D$3)","v":""},{"$f":"IF(A6=\"\",\"\",③リレー情報確認!$J$1)","v":""},{"$f":"IF(A6=\"\",\"\",③リレー情報確認!$P$1)","v":""},null,null,5,{"$f":"IF(A6=\"\",\"\",③リレー情報確認!Q12)","v":""},{"$f":"IF(A6=\"\",\"\",③リレー情報確認!P12)","v":""},{"$f":"IF(A6=\"\",\"\",種目情報!$J$6)","v":""},{"$f":"IF(A6=\"\",\"\",③リレー情報確認!$R$8)","v":""},"",{"$f":"IF(A6=\"\",\"\",種目情報!$K$6)","v":""}]
{"$rows_left_out":1}